{"text_format":"1","workbook":"xlsx","n_sheets":20,"sheets":["Inhaltsverzeichnis","Grundlage","Jahreslisten Grundang. Params","Jahreslisten erstellen Params","Matrix Auswert. Grund. Params","Matrix-Auswertung Params","Grundlagen","Excel_Tabellenblatt_Microsoft B","Pivot_Umsatz_Produkt_Region","Pivot_Umsatz_Vertrieb","Pivot_Umsatz_Ort","Vorlage_TE","TE_Vertrieb","TE_Produkt","TE_Ort","TE_Monat","Summewenns","Summewenns (Formeln)","SortierteListe Grund-Parameter","SortierteListe Parameter"],"not_rendered":{"charts":0,"images":1,"macros":0,"external_links":0,"defined_names":8,"comments":0,"pivot_tables":5},"unopened":[],"bounds":{"document_bytes":16777216,"sheet_cells":100000,"rows_first":2000,"rows_last":500,"rows_between":2000,"halvings":0,"cell_chars":16384,"cell_head_chars":4096},"cells_cut":0,"cells_raw":0,"read":"whole","date_system":"1900"}

{"sheet":"Inhaltsverzeichnis","index":0,"n_rows":15,"n_cols":3,"rows_kept":15,"cut":false,"hidden":false,"merged":[]}
["Inhaltsverzeichnis der Arbeitsblätter"]
["Lfd. Nr.","Blattname","Bemerkung"]
[1,"Inhaltsverzeichnis"]
[2,"Grundlagen"]
[3,"Excel_Tabellenblatt_Microsoft B"]
[4,"Pivot_Umsatz_Produkt_Region"]
[5,"Pivot_Umsatz_Vertrieb"]
[6,"Pivot_Umsatz_Ort"]
[7,"Vorlage_TE"]
[8,"TE_Vertrieb"]
[9,"TE_Produkt"]
[10,"TE_Ort"]
[11,"TE_Monat"]
[12,"Summewenns"]
[13,"Summewenns (Formeln)"]

{"sheet":"Grundlage","index":1,"n_rows":364,"n_cols":14,"rows_kept":364,"cut":false,"hidden":true,"merged":[]}
["Umsatz","Produkt","Vertrieb","Ort","Monat","Datum","Anzahl"]
[{"$f":"VLOOKUP(B2,M:N,2,FALSE)","v":100},100,"Vertrieb_1",{"$f":"VLOOKUP(C2,J:K,2,FALSE)","v":"Hamburg"},{"$f":"MONTH(F2)","v":1},"2021-01-03",1,null,null,"Vertrieb_1","Hamburg",null,100,100]
[{"$f":"VLOOKUP(B3,M:N,2,FALSE)","v":200},110,"Vertrieb_2",{"$f":"VLOOKUP(C3,J:K,2,FALSE)","v":"München"},{"$f":"MONTH(F3)","v":1},{"$f":"F2+1","v":"2021-01-04"},1,null,null,"Vertrieb_2","München",null,110,200]
[250,120,"Vertrieb_3","Köln",1,{"$f":"F3+1","v":"2021-01-05"},1,null,null,"Vertrieb_3","Köln",null,120,250]
[100,100,"Vertrieb_4","Frankfurt am Main",1,"2021-01-06",1,null,null,"Vertrieb_4","Frankfurt am Main"]
[200,110,"Vertrieb_1","Hamburg",1,"2021-01-07",1]
[200,110,"Vertrieb_2","München",1,"2021-01-08",1]
[250,120,"Vertrieb_3","Köln",1,"2021-01-09",1]
[100,100,"Vertrieb_4","Frankfurt am Main",1,"2021-01-10",1]
[200,110,"Vertrieb_1","Hamburg",1,"2021-01-11",1]
[250,120,"Vertrieb_2","München",1,"2021-01-12",1]
[250,120,"Vertrieb_3","Köln",1,"2021-01-13",1]
[100,100,"Vertrieb_4","Frankfurt am Main",1,"2021-01-14",1]
[200,110,"Vertrieb_1","Hamburg",1,"2021-01-15",1]
[250,120,"Vertrieb_2","München",1,"2021-01-16",1]
[100,100,"Vertrieb_3","Köln",1,"2021-01-17",1]
[200,110,"Vertrieb_4","Frankfurt am Main",1,"2021-01-18",1]
[250,120,"Vertrieb_1","Hamburg",1,"2021-01-19",1]
[100,100,"Vertrieb_2","München",1,"2021-01-20",1]
[200,110,"Vertrieb_3","Köln",1,"2021-01-21",1]
[250,120,"Vertrieb_4","Frankfurt am Main",1,"2021-01-22",1]
[100,100,"Vertrieb_1","Hamburg",1,"2021-01-23",1]
[250,120,"Vertrieb_2","München",1,"2021-01-24",1]
[100,100,"Vertrieb_3","Köln",1,"2021-01-25",1]
[200,110,"Vertrieb_4","Frankfurt am Main",1,"2021-01-26",1]
[250,120,"Vertrieb_1","Hamburg",1,"2021-01-27",1]
[100,100,"Vertrieb_2","München",1,"2021-01-28",1]
[200,110,"Vertrieb_3","Köln",1,"2021-01-29",1]
[250,120,"Vertrieb_4","Frankfurt am Main",1,"2021-01-30",1]
[100,100,"Vertrieb_1","Hamburg",1,"2021-01-31",1]
[200,110,"Vertrieb_2","München",2,"2021-02-01",1]
[250,120,"Vertrieb_3","Köln",2,"2021-02-02",1]
[100,100,"Vertrieb_4","Frankfurt am Main",2,"2021-02-03",1]
[200,110,"Vertrieb_1","Hamburg",2,"2021-02-04",1]
[250,120,"Vertrieb_2","München",2,"2021-02-05",1]
[100,100,"Vertrieb_3","Köln",2,"2021-02-06",1]
[200,110,"Vertrieb_4","Frankfurt am Main",2,"2021-02-07",1]
[250,120,"Vertrieb_1","Hamburg",2,"2021-02-08",1]
[100,100,"Vertrieb_2","München",2,"2021-02-09",1]
[200,110,"Vertrieb_3","Köln",2,"2021-02-10",1]
[250,120,"Vertrieb_4","Frankfurt am Main",2,"2021-02-11",1]
[100,100,"Vertrieb_1","Hamburg",2,"2021-02-12",1]
[200,110,"Vertrieb_2","München",2,"2021-02-13",1]
[250,120,"Vertrieb_3","Köln",2,"2021-02-14",1]
[100,100,"Vertrieb_4","Frankfurt am Main",2,"2021-02-15",1]
[200,110,"Vertrieb_1","Hamburg",2,"2021-02-16",1]
[250,120,"Vertrieb_2","München",2,"2021-02-17",1]
[100,100,"Vertrieb_3","Köln",2,"2021-02-18",1]
[200,110,"Vertrieb_4","Frankfurt am Main",2,"2021-02-19",1]
[250,120,"Vertrieb_1","Hamburg",2,"2021-02-20",1]
[100,100,"Vertrieb_2","München",2,"2021-02-21",1]
[200,110,"Vertrieb_3","Köln",2,"2021-02-22",1]
[250,120,"Vertrieb_4","Frankfurt am Main",2,"2021-02-23",1]
[200,110,"Vertrieb_1","Hamburg",2,"2021-02-24",1]
[250,120,"Vertrieb_2","München",2,"2021-02-25",1]
[100,100,"Vertrieb_3","Köln",2,"2021-02-26",1]
[200,110,"Vertrieb_4","Frankfurt am Main",2,"2021-02-27",1]
[250,120,"Vertrieb_1","Hamburg",2,"2021-02-28",1]
[100,100,"Vertrieb_2","München",3,"2021-03-01",1]
[200,110,"Vertrieb_3","Köln",3,"2021-03-02",1]
[250,120,"Vertrieb_4","Frankfurt am Main",3,"2021-03-03",1]
[100,100,"Vertrieb_1","Hamburg",3,"2021-03-04",1]
[200,110,"Vertrieb_2","München",3,"2021-03-05",1]
[250,120,"Vertrieb_3","Köln",3,"2021-03-06",1]
[100,100,"Vertrieb_4","Frankfurt am Main",3,"2021-03-07",1]
[200,110,"Vertrieb_1","Hamburg",3,"2021-03-08",1]
[{"$f":"VLOOKUP(B67,M:N,2,FALSE)","v":250},120,"Vertrieb_2",{"$f":"VLOOKUP(C67,J:K,2,FALSE)","v":"München"},{"$f":"MONTH(F67)","v":3},"2021-03-09",1]
[100,100,"Vertrieb_3","Köln",3,{"$f":"F67+1","v":"2021-03-10"},1]
[200,110,"Vertrieb_4","Frankfurt am Main",3,"2021-03-11",1]
[250,120,"Vertrieb_1","Hamburg",3,"2021-03-12",1]
[100,100,"Vertrieb_2","München",3,"2021-03-13",1]
[200,110,"Vertrieb_3","Köln",3,"2021-03-14",1]
[250,120,"Vertrieb_4","Frankfurt am Main",3,"2021-03-15",1]
[100,100,"Vertrieb_1","Hamburg",3,"2021-03-16",1]
[200,110,"Vertrieb_2","München",3,"2021-03-17",1]
[250,120,"Vertrieb_3","Köln",3,"2021-03-18",1]
[100,100,"Vertrieb_4","Frankfurt am Main",3,"2021-03-19",1]
[200,110,"Vertrieb_1","Hamburg",3,"2021-03-20",1]
[250,120,"Vertrieb_2","München",3,"2021-03-21",1]
[100,100,"Vertrieb_3","Köln",3,"2021-03-22",1]
[200,110,"Vertrieb_4","Frankfurt am Main",3,"2021-03-23",1]
[250,120,"Vertrieb_1","Hamburg",3,"2021-03-24",1]
[100,100,"Vertrieb_2","München",3,"2021-03-25",1]
[200,110,"Vertrieb_3","Köln",3,"2021-03-26",1]
[100,100,"Vertrieb_4","Frankfurt am Main",3,"2021-03-27",1]
[200,110,"Vertrieb_1","Hamburg",3,"2021-03-28",1]
[250,120,"Vertrieb_2","München",3,"2021-03-29",1]
[100,100,"Vertrieb_3","Köln",3,"2021-03-30",1]
[200,110,"Vertrieb_4","Frankfurt am Main",3,"2021-03-31",1]
[250,120,"Vertrieb_1","Hamburg",4,"2021-04-01",1]
[100,100,"Vertrieb_2","München",4,"2021-04-02",1]
[200,110,"Vertrieb_3","Köln",4,"2021-04-03",1]
[250,120,"Vertrieb_4","Frankfurt am Main",4,"2021-04-04",1]
[100,100,"Vertrieb_1","Hamburg",4,"2021-04-05",1]
[200,110,"Vertrieb_2","München",4,"2021-04-06",1]
[250,120,"Vertrieb_3","Köln",4,"2021-04-07",1]
[100,100,"Vertrieb_4","Frankfurt am Main",4,"2021-04-08",1]
[200,110,"Vertrieb_1","Hamburg",4,"2021-04-09",1]
[250,120,"Vertrieb_2","München",4,"2021-04-10",1]
[100,100,"Vertrieb_3","Köln",4,"2021-04-11",1]
[200,110,"Vertrieb_4","Frankfurt am Main",4,"2021-04-12",1]
[250,120,"Vertrieb_1","Hamburg",4,"2021-04-13",1]
[100,100,"Vertrieb_2","München",4,"2021-04-14",1]
[200,110,"Vertrieb_3","Köln",4,"2021-04-15",1]
[250,120,"Vertrieb_4","Frankfurt am Main",4,"2021-04-16",1]
[100,100,"Vertrieb_1","Hamburg",4,"2021-04-17",1]
[200,110,"Vertrieb_2","München",4,"2021-04-18",1]
[250,120,"Vertrieb_3","Köln",4,"2021-04-19",1]
[100,100,"Vertrieb_4","Frankfurt am Main",4,"2021-04-20",1]
[200,110,"Vertrieb_1","Hamburg",4,"2021-04-21",1]
[250,120,"Vertrieb_2","München",4,"2021-04-22",1]
[100,100,"Vertrieb_3","Köln",4,"2021-04-23",1]
[200,110,"Vertrieb_4","Frankfurt am Main",4,"2021-04-24",1]
[250,120,"Vertrieb_1","Hamburg",4,"2021-04-25",1]
[100,100,"Vertrieb_2","München",4,"2021-04-26",1]
[100,100,"Vertrieb_3","Köln",4,"2021-04-27",1]
[200,110,"Vertrieb_4","Frankfurt am Main",4,"2021-04-28",1]
[250,120,"Vertrieb_1","Hamburg",4,"2021-04-29",1]
[100,100,"Vertrieb_2","München",4,"2021-04-30",1]
[200,110,"Vertrieb_3","Köln",5,"2021-05-01",1]
[250,120,"Vertrieb_4","Frankfurt am Main",5,"2021-05-02",1]
[100,100,"Vertrieb_1","Hamburg",5,"2021-05-03",1]
[200,110,"Vertrieb_2","München",5,"2021-05-04",1]
[250,120,"Vertrieb_3","Köln",5,"2021-05-05",1]
[100,100,"Vertrieb_4","Frankfurt am Main",5,"2021-05-06",1]
[200,110,"Vertrieb_1","Hamburg",5,"2021-05-07",1]
[250,120,"Vertrieb_2","München",5,"2021-05-08",1]
[100,100,"Vertrieb_3","Köln",5,"2021-05-09",1]
[200,110,"Vertrieb_4","Frankfurt am Main",5,"2021-05-10",1]
[250,120,"Vertrieb_1","Hamburg",5,"2021-05-11",1]
[{"$f":"VLOOKUP(B131,M:N,2,FALSE)","v":100},100,"Vertrieb_2",{"$f":"VLOOKUP(C131,J:K,2,FALSE)","v":"München"},{"$f":"MONTH(F131)","v":5},"2021-05-12",1]
[200,110,"Vertrieb_3","Köln",5,{"$f":"F131+1","v":"2021-05-13"},1]
[250,120,"Vertrieb_4","Frankfurt am Main",5,"2021-05-14",1]
[100,100,"Vertrieb_1","Hamburg",5,"2021-05-15",1]
[200,110,"Vertrieb_2","München",5,"2021-05-16",1]
[250,120,"Vertrieb_3","Köln",5,"2021-05-17",1]
[100,100,"Vertrieb_4","Frankfurt am Main",5,"2021-05-18",1]
[200,110,"Vertrieb_1","Hamburg",5,"2021-05-19",1]
[250,120,"Vertrieb_2","München",5,"2021-05-20",1]
[100,100,"Vertrieb_3","Köln",5,"2021-05-21",1]
[200,110,"Vertrieb_4","Frankfurt am Main",5,"2021-05-22",1]
[250,120,"Vertrieb_1","Hamburg",5,"2021-05-23",1]
[100,100,"Vertrieb_2","München",5,"2021-05-24",1]
[200,110,"Vertrieb_3","Köln",5,"2021-05-25",1]
[250,120,"Vertrieb_4","Frankfurt am Main",5,"2021-05-26",1]
[100,100,"Vertrieb_1","Hamburg",5,"2021-05-27",1]
[250,120,"Vertrieb_2","München",5,"2021-05-28",1]
[100,100,"Vertrieb_3","Köln",5,"2021-05-29",1]
[200,110,"Vertrieb_4","Frankfurt am Main",5,"2021-05-30",1]
[250,120,"Vertrieb_1","Hamburg",5,"2021-05-31",1]
[100,100,"Vertrieb_2","München",6,"2021-06-01",1]
[200,110,"Vertrieb_3","Köln",6,"2021-06-02",1]
[250,120,"Vertrieb_4","Frankfurt am Main",6,"2021-06-03",1]
[100,100,"Vertrieb_1","Hamburg",6,"2021-06-04",1]
[200,110,"Vertrieb_2","München",6,"2021-06-05",1]
[250,120,"Vertrieb_3","Köln",6,"2021-06-06",1]
[100,100,"Vertrieb_4","Frankfurt am Main",6,"2021-06-07",1]
[200,110,"Vertrieb_1","Hamburg",6,"2021-06-08",1]
[250,120,"Vertrieb_2","München",6,"2021-06-09",1]
[100,100,"Vertrieb_3","Köln",6,"2021-06-10",1]
[200,110,"Vertrieb_4","Frankfurt am Main",6,"2021-06-11",1]
[250,120,"Vertrieb_1","Hamburg",6,"2021-06-12",1]
[100,100,"Vertrieb_2","München",6,"2021-06-13",1]
[200,110,"Vertrieb_3","Köln",6,"2021-06-14",1]
[250,120,"Vertrieb_4","Frankfurt am Main",6,"2021-06-15",1]
[100,100,"Vertrieb_1","Hamburg",6,"2021-06-16",1]
[200,110,"Vertrieb_2","München",6,"2021-06-17",1]
[250,120,"Vertrieb_3","Köln",6,"2021-06-18",1]
[100,100,"Vertrieb_4","Frankfurt am Main",6,"2021-06-19",1]
[200,110,"Vertrieb_1","Hamburg",6,"2021-06-20",1]
[250,120,"Vertrieb_2","München",6,"2021-06-21",1]
[100,100,"Vertrieb_3","Köln",6,"2021-06-22",1]
[200,110,"Vertrieb_4","Frankfurt am Main",6,"2021-06-23",1]
[250,120,"Vertrieb_1","Hamburg",6,"2021-06-24",1]
[100,100,"Vertrieb_2","München",6,"2021-06-25",1]
[200,110,"Vertrieb_3","Köln",6,"2021-06-26",1]
[250,120,"Vertrieb_4","Frankfurt am Main",6,"2021-06-27",1]
[200,110,"Vertrieb_1","Hamburg",6,"2021-06-28",1]
[250,120,"Vertrieb_2","München",6,"2021-06-29",1]
[100,100,"Vertrieb_3","Köln",6,"2021-06-30",1]
[200,110,"Vertrieb_4","Frankfurt am Main",7,"2021-07-01",1]
[250,120,"Vertrieb_1","Hamburg",7,"2021-07-02",1]
[100,100,"Vertrieb_2","München",7,"2021-07-03",1]
[200,110,"Vertrieb_3","Köln",7,"2021-07-04",1]
[250,120,"Vertrieb_4","Frankfurt am Main",7,"2021-07-05",1]
[100,100,"Vertrieb_1","Hamburg",7,"2021-07-06",1]
[200,110,"Vertrieb_2","München",7,"2021-07-07",1]
[250,120,"Vertrieb_3","Köln",7,"2021-07-08",1]
[100,100,"Vertrieb_4","Frankfurt am Main",7,"2021-07-09",1]
[200,110,"Vertrieb_1","Hamburg",7,"2021-07-10",1]
[250,120,"Vertrieb_2","München",7,"2021-07-11",1]
[100,100,"Vertrieb_3","Köln",7,"2021-07-12",1]
[200,110,"Vertrieb_4","Frankfurt am Main",7,"2021-07-13",1]
[250,120,"Vertrieb_1","Hamburg",7,"2021-07-14",1]
[{"$f":"VLOOKUP(B195,M:N,2,FALSE)","v":100},100,"Vertrieb_2",{"$f":"VLOOKUP(C195,J:K,2,FALSE)","v":"München"},{"$f":"MONTH(F195)","v":7},"2021-07-15",1]
[200,110,"Vertrieb_3","Köln",7,{"$f":"F195+1","v":"2021-07-16"},1]
[250,120,"Vertrieb_4","Frankfurt am Main",7,"2021-07-17",1]
[100,100,"Vertrieb_1","Hamburg",7,"2021-07-18",1]
[200,110,"Vertrieb_2","München",7,"2021-07-19",1]
[250,120,"Vertrieb_3","Köln",7,"2021-07-20",1]
[100,100,"Vertrieb_4","Frankfurt am Main",7,"2021-07-21",1]
[200,110,"Vertrieb_1","Hamburg",7,"2021-07-22",1]
[250,120,"Vertrieb_2","München",7,"2021-07-23",1]
[100,100,"Vertrieb_3","Köln",7,"2021-07-24",1]
[200,110,"Vertrieb_4","Frankfurt am Main",7,"2021-07-25",1]
[250,120,"Vertrieb_1","Hamburg",7,"2021-07-26",1]
[100,100,"Vertrieb_2","München",7,"2021-07-27",1]
[200,110,"Vertrieb_3","Köln",7,"2021-07-28",1]
[100,100,"Vertrieb_4","Frankfurt am Main",7,"2021-07-29",1]
[200,110,"Vertrieb_1","Hamburg",7,"2021-07-30",1]
[250,120,"Vertrieb_2","München",7,"2021-07-31",1]
[100,100,"Vertrieb_3","Köln",8,"2021-08-01",1]
[200,110,"Vertrieb_4","Frankfurt am Main",8,"2021-08-02",1]
[250,120,"Vertrieb_1","Hamburg",8,"2021-08-03",1]
[100,100,"Vertrieb_2","München",8,"2021-08-04",1]
[200,110,"Vertrieb_3","Köln",8,"2021-08-05",1]
[250,120,"Vertrieb_4","Frankfurt am Main",8,"2021-08-06",1]
[100,100,"Vertrieb_1","Hamburg",8,"2021-08-07",1]
[200,110,"Vertrieb_2","München",8,"2021-08-08",1]
[250,120,"Vertrieb_3","Köln",8,"2021-08-09",1]
[100,100,"Vertrieb_4","Frankfurt am Main",8,"2021-08-10",1]
[200,110,"Vertrieb_1","Hamburg",8,"2021-08-11",1]
[250,120,"Vertrieb_2","München",8,"2021-08-12",1]
[100,100,"Vertrieb_3","Köln",8,"2021-08-13",1]
[200,110,"Vertrieb_4","Frankfurt am Main",8,"2021-08-14",1]
[250,120,"Vertrieb_1","Hamburg",8,"2021-08-15",1]
[100,100,"Vertrieb_2","München",8,"2021-08-16",1]
[200,110,"Vertrieb_3","Köln",8,"2021-08-17",1]
[250,120,"Vertrieb_4","Frankfurt am Main",8,"2021-08-18",1]
[100,100,"Vertrieb_1","Hamburg",8,"2021-08-19",1]
[200,110,"Vertrieb_2","München",8,"2021-08-20",1]
[250,120,"Vertrieb_3","Köln",8,"2021-08-21",1]
[100,100,"Vertrieb_4","Frankfurt am Main",8,"2021-08-22",1]
[200,110,"Vertrieb_1","Hamburg",8,"2021-08-23",1]
[250,120,"Vertrieb_2","München",8,"2021-08-24",1]
[100,100,"Vertrieb_3","Köln",8,"2021-08-25",1]
[200,110,"Vertrieb_4","Frankfurt am Main",8,"2021-08-26",1]
[250,120,"Vertrieb_1","Hamburg",8,"2021-08-27",1]
[100,100,"Vertrieb_2","München",8,"2021-08-28",1]
[100,100,"Vertrieb_3","Köln",8,"2021-08-29",1]
[200,110,"Vertrieb_4","Frankfurt am Main",8,"2021-08-30",1]
[250,120,"Vertrieb_1","Hamburg",8,"2021-08-31",1]
[100,100,"Vertrieb_2","München",9,"2021-09-01",1]
[200,110,"Vertrieb_3","Köln",9,"2021-09-02",1]
[250,120,"Vertrieb_4","Frankfurt am Main",9,"2021-09-03",1]
[100,100,"Vertrieb_1","Hamburg",9,"2021-09-04",1]
[200,110,"Vertrieb_2","München",9,"2021-09-05",1]
[250,120,"Vertrieb_3","Köln",9,"2021-09-06",1]
[100,100,"Vertrieb_4","Frankfurt am Main",9,"2021-09-07",1]
[200,110,"Vertrieb_1","Hamburg",9,"2021-09-08",1]
[250,120,"Vertrieb_2","München",9,"2021-09-09",1]
[100,100,"Vertrieb_3","Köln",9,"2021-09-10",1]
[200,110,"Vertrieb_4","Frankfurt am Main",9,"2021-09-11",1]
[250,120,"Vertrieb_1","Hamburg",9,"2021-09-12",1]
[100,100,"Vertrieb_2","München",9,"2021-09-13",1]
[200,110,"Vertrieb_3","Köln",9,"2021-09-14",1]
[250,120,"Vertrieb_4","Frankfurt am Main",9,"2021-09-15",1]
[100,100,"Vertrieb_1","Hamburg",9,"2021-09-16",1]
[{"$f":"VLOOKUP(B259,M:N,2,FALSE)","v":200},110,"Vertrieb_2",{"$f":"VLOOKUP(C259,J:K,2,FALSE)","v":"München"},{"$f":"MONTH(F259)","v":9},"2021-09-17",1]
[250,120,"Vertrieb_3","Köln",9,{"$f":"F259+1","v":"2021-09-18"},1]
[100,100,"Vertrieb_4","Frankfurt am Main",9,"2021-09-19",1]
[200,110,"Vertrieb_1","Hamburg",9,"2021-09-20",1]
[250,120,"Vertrieb_2","München",9,"2021-09-21",1]
[100,100,"Vertrieb_3","Köln",9,"2021-09-22",1]
[200,110,"Vertrieb_4","Frankfurt am Main",9,"2021-09-23",1]
[250,120,"Vertrieb_1","Hamburg",9,"2021-09-24",1]
[100,100,"Vertrieb_2","München",9,"2021-09-25",1]
[200,110,"Vertrieb_3","Köln",9,"2021-09-26",1]
[250,120,"Vertrieb_4","Frankfurt am Main",9,"2021-09-27",1]
[100,100,"Vertrieb_1","Hamburg",9,"2021-09-28",1]
[250,120,"Vertrieb_2","München",9,"2021-09-29",1]
[100,100,"Vertrieb_3","Köln",9,"2021-09-30",1]
[200,110,"Vertrieb_4","Frankfurt am Main",10,"2021-10-01",1]
[250,120,"Vertrieb_1","Hamburg",10,"2021-10-02",1]
[100,100,"Vertrieb_2","München",10,"2021-10-03",1]
[200,110,"Vertrieb_3","Köln",10,"2021-10-04",1]
[250,120,"Vertrieb_4","Frankfurt am Main",10,"2021-10-05",1]
[100,100,"Vertrieb_1","Hamburg",10,"2021-10-06",1]
[200,110,"Vertrieb_2","München",10,"2021-10-07",1]
[250,120,"Vertrieb_3","Köln",10,"2021-10-08",1]
[100,100,"Vertrieb_4","Frankfurt am Main",10,"2021-10-09",1]
[200,110,"Vertrieb_1","Hamburg",10,"2021-10-10",1]
[250,120,"Vertrieb_2","München",10,"2021-10-11",1]
[100,100,"Vertrieb_3","Köln",10,"2021-10-12",1]
[200,110,"Vertrieb_4","Frankfurt am Main",10,"2021-10-13",1]
[250,120,"Vertrieb_1","Hamburg",10,"2021-10-14",1]
[100,100,"Vertrieb_2","München",10,"2021-10-15",1]
[200,110,"Vertrieb_3","Köln",10,"2021-10-16",1]
[250,120,"Vertrieb_4","Frankfurt am Main",10,"2021-10-17",1]
[100,100,"Vertrieb_1","Hamburg",10,"2021-10-18",1]
[200,110,"Vertrieb_2","München",10,"2021-10-19",1]
[250,120,"Vertrieb_3","Köln",10,"2021-10-20",1]
[100,100,"Vertrieb_4","Frankfurt am Main",10,"2021-10-21",1]
[200,110,"Vertrieb_1","Hamburg",10,"2021-10-22",1]
[250,120,"Vertrieb_2","München",10,"2021-10-23",1]
[100,100,"Vertrieb_3","Köln",10,"2021-10-24",1]
[200,110,"Vertrieb_4","Frankfurt am Main",10,"2021-10-25",1]
[250,120,"Vertrieb_1","Hamburg",10,"2021-10-26",1]
[100,100,"Vertrieb_2","München",10,"2021-10-27",1]
[200,110,"Vertrieb_3","Köln",10,"2021-10-28",1]
[250,120,"Vertrieb_4","Frankfurt am Main",10,"2021-10-29",1]
[200,110,"Vertrieb_1","Hamburg",10,"2021-10-30",1]
[250,120,"Vertrieb_2","München",10,"2021-10-31",1]
[100,100,"Vertrieb_3","Köln",11,"2021-11-01",1]
[200,110,"Vertrieb_4","Frankfurt am Main",11,"2021-11-02",1]
[250,120,"Vertrieb_1","Hamburg",11,"2021-11-03",1]
[100,100,"Vertrieb_2","München",11,"2021-11-04",1]
[200,110,"Vertrieb_3","Köln",11,"2021-11-05",1]
[250,120,"Vertrieb_4","Frankfurt am Main",11,"2021-11-06",1]
[100,100,"Vertrieb_1","Hamburg",11,"2021-11-07",1]
[200,110,"Vertrieb_2","München",11,"2021-11-08",1]
[250,120,"Vertrieb_3","Köln",11,"2021-11-09",1]
[100,100,"Vertrieb_4","Frankfurt am Main",11,"2021-11-10",1]
[200,110,"Vertrieb_1","Hamburg",11,"2021-11-11",1]
[250,120,"Vertrieb_2","München",11,"2021-11-12",1]
[100,100,"Vertrieb_3","Köln",11,"2021-11-13",1]
[200,110,"Vertrieb_4","Frankfurt am Main",11,"2021-11-14",1]
[250,120,"Vertrieb_1","Hamburg",11,"2021-11-15",1]
[100,100,"Vertrieb_2","München",11,"2021-11-16",1]
[200,110,"Vertrieb_3","Köln",11,"2021-11-17",1]
[250,120,"Vertrieb_4","Frankfurt am Main",11,"2021-11-18",1]
[100,100,"Vertrieb_1","Hamburg",11,"2021-11-19",1]
[{"$f":"VLOOKUP(B323,M:N,2,FALSE)","v":200},110,"Vertrieb_2",{"$f":"VLOOKUP(C323,J:K,2,FALSE)","v":"München"},{"$f":"MONTH(F323)","v":11},"2021-11-20",1]
[250,120,"Vertrieb_3","Köln",11,{"$f":"F323+1","v":"2021-11-21"},1]
[100,100,"Vertrieb_4","Frankfurt am Main",11,"2021-11-22",1]
[200,110,"Vertrieb_1","Hamburg",11,"2021-11-23",1]
[250,120,"Vertrieb_2","München",11,"2021-11-24",1]
[100,100,"Vertrieb_3","Köln",11,"2021-11-25",1]
[200,110,"Vertrieb_4","Frankfurt am Main",11,"2021-11-26",1]
[250,120,"Vertrieb_1","Hamburg",11,"2021-11-27",1]
[100,100,"Vertrieb_2","München",11,"2021-11-28",1]
[200,110,"Vertrieb_3","Köln",11,"2021-11-29",1]
[100,100,"Vertrieb_4","Frankfurt am Main",11,"2021-11-30",1]
[200,110,"Vertrieb_1","Hamburg",12,"2021-12-01",1]
[250,120,"Vertrieb_2","München",12,"2021-12-02",1]
[100,100,"Vertrieb_3","Köln",12,"2021-12-03",1]
[200,110,"Vertrieb_4","Frankfurt am Main",12,"2021-12-04",1]
[250,120,"Vertrieb_1","Hamburg",12,"2021-12-05",1]
[100,100,"Vertrieb_2","München",12,"2021-12-06",1]
[200,110,"Vertrieb_3","Köln",12,"2021-12-07",1]
[250,120,"Vertrieb_4","Frankfurt am Main",12,"2021-12-08",1]
[100,100,"Vertrieb_1","Hamburg",12,"2021-12-09",1]
[200,110,"Vertrieb_2","München",12,"2021-12-10",1]
[250,120,"Vertrieb_3","Köln",12,"2021-12-11",1]
[100,100,"Vertrieb_4","Frankfurt am Main",12,"2021-12-12",1]
[200,110,"Vertrieb_1","Hamburg",12,"2021-12-13",1]
[250,120,"Vertrieb_2","München",12,"2021-12-14",1]
[100,100,"Vertrieb_3","Köln",12,"2021-12-15",1]
[200,110,"Vertrieb_4","Frankfurt am Main",12,"2021-12-16",1]
[250,120,"Vertrieb_1","Hamburg",12,"2021-12-17",1]
[100,100,"Vertrieb_2","München",12,"2021-12-18",1]
[200,110,"Vertrieb_3","Köln",12,"2021-12-19",1]
[250,120,"Vertrieb_4","Frankfurt am Main",12,"2021-12-20",1]
[100,100,"Vertrieb_1","Hamburg",12,"2021-12-21",1]
[200,110,"Vertrieb_2","München",12,"2021-12-22",1]
[250,120,"Vertrieb_3","Köln",12,"2021-12-23",1]
[100,100,"Vertrieb_4","Frankfurt am Main",12,"2021-12-24",1]
[200,110,"Vertrieb_1","Hamburg",12,"2021-12-25",1]
[250,120,"Vertrieb_2","München",12,"2021-12-26",1]
[100,100,"Vertrieb_3","Köln",12,"2021-12-27",1]
[200,110,"Vertrieb_4","Frankfurt am Main",12,"2021-12-28",1]
[250,120,"Vertrieb_1","Hamburg",12,"2021-12-29",1]
[100,100,"Vertrieb_2","München",12,"2021-12-30",1]
[100,100,"Vertrieb_3","Köln",12,"2021-12-31",1]

{"sheet":"Jahreslisten Grundang. Params","index":2,"n_rows":4,"n_cols":2,"rows_kept":4,"cut":false,"hidden":true,"merged":[]}
["WU-Tools Version","V2.38"]
["Beginnzeile der Liste",2]
["Kopfzeile",1]
["Rechnungsdatumspalte","F"]

{"sheet":"Jahreslisten erstellen Params","index":3,"n_rows":8,"n_cols":2,"rows_kept":8,"cut":false,"hidden":true,"merged":[]}
["WU-Tools Version","V2.38"]
[]
[]
["Hauptkriteriumspalte","B"]
[]
["Rechnungsbetragspalte","A"]
["Anzahl Jahre",1]
["Jahre für die Listen erstellt werden",2021]

{"sheet":"Matrix Auswert. Grund. Params","index":4,"n_rows":7,"n_cols":2,"rows_kept":7,"cut":false,"hidden":true,"merged":[]}
["WU-Tools Version","V2.38"]
["Kopfzeile",1]
["Als Matrix-Tabelle in Blatt",false]
["Tabelle mit Formeln",true]
["Tabelle mit Werten",false]
["Als Pivot-Tabelle in Blatt",true]
["Letzte Zeile nicht berücksichtigen",false]

{"sheet":"Matrix-Auswertung Params","index":5,"n_rows":6,"n_cols":2,"rows_kept":6,"cut":false,"hidden":true,"merged":[]}
["WU-Tools Version","V2.38"]
[]
[]
["Matrix-Zeilen","Vertrieb"]
["Matrix-Spalten","Produkt"]
["Matrix-Werte","Umsatz"]

{"sheet":"Grundlagen","index":6,"n_rows":365,"n_cols":9,"rows_kept":365,"cut":false,"hidden":false,"merged":[]}
["lfd. Nr.","Anzahl","Umsatz","Produkt","Vertrieb","Ort","Monat","Datum","Anzahl"]
[1,1,100,100,"Vertrieb_1","Hamburg",1,"2021-01-03",1]
[{"$f":"A2+1","v":2},1,200,110,"Vertrieb_2","München",1,"2021-01-04",1]
[{"$f":"A3+1","v":3},1,250,120,"Vertrieb_3","Köln",1,"2021-01-05",1]
[4,1,100,100,"Vertrieb_4","Frankfurt am Main",1,"2021-01-06",1]
[5,1,200,110,"Vertrieb_1","Hamburg",1,"2021-01-07",1]
[6,1,200,110,"Vertrieb_2","München",1,"2021-01-08",1]
[7,1,250,120,"Vertrieb_3","Köln",1,"2021-01-09",1]
[8,1,100,100,"Vertrieb_4","Frankfurt am Main",1,"2021-01-10",1]
[9,1,200,110,"Vertrieb_1","Hamburg",1,"2021-01-11",1]
[10,1,250,120,"Vertrieb_2","München",1,"2021-01-12",1]
[11,1,250,120,"Vertrieb_3","Köln",1,"2021-01-13",1]
[12,1,100,100,"Vertrieb_4","Frankfurt am Main",1,"2021-01-14",1]
[13,1,200,110,"Vertrieb_1","Hamburg",1,"2021-01-15",1]
[14,1,250,120,"Vertrieb_2","München",1,"2021-01-16",1]
[15,1,100,100,"Vertrieb_3","Köln",1,"2021-01-17",1]
[16,1,200,110,"Vertrieb_4","Frankfurt am Main",1,"2021-01-18",1]
[17,1,250,120,"Vertrieb_1","Hamburg",1,"2021-01-19",1]
[18,1,100,100,"Vertrieb_2","München",1,"2021-01-20",1]
[19,1,200,110,"Vertrieb_3","Köln",1,"2021-01-21",1]
[20,1,250,120,"Vertrieb_4","Frankfurt am Main",1,"2021-01-22",1]
[21,1,100,100,"Vertrieb_1","Hamburg",1,"2021-01-23",1]
[22,1,250,120,"Vertrieb_2","München",1,"2021-01-24",1]
[23,1,100,100,"Vertrieb_3","Köln",1,"2021-01-25",1]
[24,1,200,110,"Vertrieb_4","Frankfurt am Main",1,"2021-01-26",1]
[25,1,250,120,"Vertrieb_1","Hamburg",1,"2021-01-27",1]
[26,1,100,100,"Vertrieb_2","München",1,"2021-01-28",1]
[27,1,200,110,"Vertrieb_3","Köln",1,"2021-01-29",1]
[28,1,250,120,"Vertrieb_4","Frankfurt am Main",1,"2021-01-30",1]
[29,1,100,100,"Vertrieb_1","Hamburg",1,"2021-01-31",1]
[30,1,200,110,"Vertrieb_2","München",2,"2021-02-01",1]
[31,1,250,120,"Vertrieb_3","Köln",2,"2021-02-02",1]
[32,1,100,100,"Vertrieb_4","Frankfurt am Main",2,"2021-02-03",1]
[33,1,200,110,"Vertrieb_1","Hamburg",2,"2021-02-04",1]
[34,1,250,120,"Vertrieb_2","München",2,"2021-02-05",1]
[35,1,100,100,"Vertrieb_3","Köln",2,"2021-02-06",1]
[36,1,200,110,"Vertrieb_4","Frankfurt am Main",2,"2021-02-07",1]
[37,1,250,120,"Vertrieb_1","Hamburg",2,"2021-02-08",1]
[38,1,100,100,"Vertrieb_2","München",2,"2021-02-09",1]
[39,1,200,110,"Vertrieb_3","Köln",2,"2021-02-10",1]
[40,1,250,120,"Vertrieb_4","Frankfurt am Main",2,"2021-02-11",1]
[41,1,100,100,"Vertrieb_1","Hamburg",2,"2021-02-12",1]
[42,1,200,110,"Vertrieb_2","München",2,"2021-02-13",1]
[43,1,250,120,"Vertrieb_3","Köln",2,"2021-02-14",1]
[44,1,100,100,"Vertrieb_4","Frankfurt am Main",2,"2021-02-15",1]
[45,1,200,110,"Vertrieb_1","Hamburg",2,"2021-02-16",1]
[46,1,250,120,"Vertrieb_2","München",2,"2021-02-17",1]
[47,1,100,100,"Vertrieb_3","Köln",2,"2021-02-18",1]
[48,1,200,110,"Vertrieb_4","Frankfurt am Main",2,"2021-02-19",1]
[49,1,250,120,"Vertrieb_1","Hamburg",2,"2021-02-20",1]
[50,1,100,100,"Vertrieb_2","München",2,"2021-02-21",1]
[51,1,200,110,"Vertrieb_3","Köln",2,"2021-02-22",1]
[52,1,250,120,"Vertrieb_4","Frankfurt am Main",2,"2021-02-23",1]
[53,1,200,110,"Vertrieb_1","Hamburg",2,"2021-02-24",1]
[54,1,250,120,"Vertrieb_2","München",2,"2021-02-25",1]
[55,1,100,100,"Vertrieb_3","Köln",2,"2021-02-26",1]
[56,1,200,110,"Vertrieb_4","Frankfurt am Main",2,"2021-02-27",1]
[57,1,250,120,"Vertrieb_1","Hamburg",2,"2021-02-28",1]
[58,1,100,100,"Vertrieb_2","München",3,"2021-03-01",1]
[59,1,200,110,"Vertrieb_3","Köln",3,"2021-03-02",1]
[60,1,250,120,"Vertrieb_4","Frankfurt am Main",3,"2021-03-03",1]
[61,1,100,100,"Vertrieb_1","Hamburg",3,"2021-03-04",1]
[62,1,200,110,"Vertrieb_2","München",3,"2021-03-05",1]
[63,1,250,120,"Vertrieb_3","Köln",3,"2021-03-06",1]
[64,1,100,100,"Vertrieb_4","Frankfurt am Main",3,"2021-03-07",1]
[65,1,200,110,"Vertrieb_1","Hamburg",3,"2021-03-08",1]
[66,1,250,120,"Vertrieb_2","München",3,"2021-03-09",1]
[{"$f":"A67+1","v":67},1,100,100,"Vertrieb_3","Köln",3,"2021-03-10",1]
[68,1,200,110,"Vertrieb_4","Frankfurt am Main",3,"2021-03-11",1]
[69,1,250,120,"Vertrieb_1","Hamburg",3,"2021-03-12",1]
[70,1,100,100,"Vertrieb_2","München",3,"2021-03-13",1]
[71,1,200,110,"Vertrieb_3","Köln",3,"2021-03-14",1]
[72,1,250,120,"Vertrieb_4","Frankfurt am Main",3,"2021-03-15",1]
[73,1,100,100,"Vertrieb_1","Hamburg",3,"2021-03-16",1]
[74,1,200,110,"Vertrieb_2","München",3,"2021-03-17",1]
[75,1,250,120,"Vertrieb_3","Köln",3,"2021-03-18",1]
[76,1,100,100,"Vertrieb_4","Frankfurt am Main",3,"2021-03-19",1]
[77,1,200,110,"Vertrieb_1","Hamburg",3,"2021-03-20",1]
[78,1,250,120,"Vertrieb_2","München",3,"2021-03-21",1]
[79,1,100,100,"Vertrieb_3","Köln",3,"2021-03-22",1]
[80,1,200,110,"Vertrieb_4","Frankfurt am Main",3,"2021-03-23",1]
[81,1,250,120,"Vertrieb_1","Hamburg",3,"2021-03-24",1]
[82,1,100,100,"Vertrieb_2","München",3,"2021-03-25",1]
[83,1,200,110,"Vertrieb_3","Köln",3,"2021-03-26",1]
[84,1,100,100,"Vertrieb_4","Frankfurt am Main",3,"2021-03-27",1]
[85,1,200,110,"Vertrieb_1","Hamburg",3,"2021-03-28",1]
[86,1,250,120,"Vertrieb_2","München",3,"2021-03-29",1]
[87,1,100,100,"Vertrieb_3","Köln",3,"2021-03-30",1]
[88,1,200,110,"Vertrieb_4","Frankfurt am Main",3,"2021-03-31",1]
[89,1,250,120,"Vertrieb_1","Hamburg",4,"2021-04-01",1]
[90,1,100,100,"Vertrieb_2","München",4,"2021-04-02",1]
[91,1,200,110,"Vertrieb_3","Köln",4,"2021-04-03",1]
[92,1,250,120,"Vertrieb_4","Frankfurt am Main",4,"2021-04-04",1]
[93,1,100,100,"Vertrieb_1","Hamburg",4,"2021-04-05",1]
[94,1,200,110,"Vertrieb_2","München",4,"2021-04-06",1]
[95,1,250,120,"Vertrieb_3","Köln",4,"2021-04-07",1]
[96,1,100,100,"Vertrieb_4","Frankfurt am Main",4,"2021-04-08",1]
[97,1,200,110,"Vertrieb_1","Hamburg",4,"2021-04-09",1]
[98,1,250,120,"Vertrieb_2","München",4,"2021-04-10",1]
[99,1,100,100,"Vertrieb_3","Köln",4,"2021-04-11",1]
[100,1,200,110,"Vertrieb_4","Frankfurt am Main",4,"2021-04-12",1]
[101,1,250,120,"Vertrieb_1","Hamburg",4,"2021-04-13",1]
[102,1,100,100,"Vertrieb_2","München",4,"2021-04-14",1]
[103,1,200,110,"Vertrieb_3","Köln",4,"2021-04-15",1]
[104,1,250,120,"Vertrieb_4","Frankfurt am Main",4,"2021-04-16",1]
[105,1,100,100,"Vertrieb_1","Hamburg",4,"2021-04-17",1]
[106,1,200,110,"Vertrieb_2","München",4,"2021-04-18",1]
[107,1,250,120,"Vertrieb_3","Köln",4,"2021-04-19",1]
[108,1,100,100,"Vertrieb_4","Frankfurt am Main",4,"2021-04-20",1]
[109,1,200,110,"Vertrieb_1","Hamburg",4,"2021-04-21",1]
[110,1,250,120,"Vertrieb_2","München",4,"2021-04-22",1]
[111,1,100,100,"Vertrieb_3","Köln",4,"2021-04-23",1]
[112,1,200,110,"Vertrieb_4","Frankfurt am Main",4,"2021-04-24",1]
[113,1,250,120,"Vertrieb_1","Hamburg",4,"2021-04-25",1]
[114,1,100,100,"Vertrieb_2","München",4,"2021-04-26",1]
[115,1,100,100,"Vertrieb_3","Köln",4,"2021-04-27",1]
[116,1,200,110,"Vertrieb_4","Frankfurt am Main",4,"2021-04-28",1]
[117,1,250,120,"Vertrieb_1","Hamburg",4,"2021-04-29",1]
[118,1,100,100,"Vertrieb_2","München",4,"2021-04-30",1]
[119,1,200,110,"Vertrieb_3","Köln",5,"2021-05-01",1]
[120,1,250,120,"Vertrieb_4","Frankfurt am Main",5,"2021-05-02",1]
[121,1,100,100,"Vertrieb_1","Hamburg",5,"2021-05-03",1]
[122,1,200,110,"Vertrieb_2","München",5,"2021-05-04",1]
[123,1,250,120,"Vertrieb_3","Köln",5,"2021-05-05",1]
[124,1,100,100,"Vertrieb_4","Frankfurt am Main",5,"2021-05-06",1]
[125,1,200,110,"Vertrieb_1","Hamburg",5,"2021-05-07",1]
[126,1,250,120,"Vertrieb_2","München",5,"2021-05-08",1]
[127,1,100,100,"Vertrieb_3","Köln",5,"2021-05-09",1]
[128,1,200,110,"Vertrieb_4","Frankfurt am Main",5,"2021-05-10",1]
[129,1,250,120,"Vertrieb_1","Hamburg",5,"2021-05-11",1]
[130,1,100,100,"Vertrieb_2","München",5,"2021-05-12",1]
[{"$f":"A131+1","v":131},1,200,110,"Vertrieb_3","Köln",5,"2021-05-13",1]
[132,1,250,120,"Vertrieb_4","Frankfurt am Main",5,"2021-05-14",1]
[133,1,100,100,"Vertrieb_1","Hamburg",5,"2021-05-15",1]
[134,1,200,110,"Vertrieb_2","München",5,"2021-05-16",1]
[135,1,250,120,"Vertrieb_3","Köln",5,"2021-05-17",1]
[136,1,100,100,"Vertrieb_4","Frankfurt am Main",5,"2021-05-18",1]
[137,1,200,110,"Vertrieb_1","Hamburg",5,"2021-05-19",1]
[138,1,250,120,"Vertrieb_2","München",5,"2021-05-20",1]
[139,1,100,100,"Vertrieb_3","Köln",5,"2021-05-21",1]
[140,1,200,110,"Vertrieb_4","Frankfurt am Main",5,"2021-05-22",1]
[141,1,250,120,"Vertrieb_1","Hamburg",5,"2021-05-23",1]
[142,1,100,100,"Vertrieb_2","München",5,"2021-05-24",1]
[143,1,200,110,"Vertrieb_3","Köln",5,"2021-05-25",1]
[144,1,250,120,"Vertrieb_4","Frankfurt am Main",5,"2021-05-26",1]
[145,1,100,100,"Vertrieb_1","Hamburg",5,"2021-05-27",1]
[146,1,250,120,"Vertrieb_2","München",5,"2021-05-28",1]
[147,1,100,100,"Vertrieb_3","Köln",5,"2021-05-29",1]
[148,1,200,110,"Vertrieb_4","Frankfurt am Main",5,"2021-05-30",1]
[149,1,250,120,"Vertrieb_1","Hamburg",5,"2021-05-31",1]
[150,1,100,100,"Vertrieb_2","München",6,"2021-06-01",1]
[151,1,200,110,"Vertrieb_3","Köln",6,"2021-06-02",1]
[152,1,250,120,"Vertrieb_4","Frankfurt am Main",6,"2021-06-03",1]
[153,1,100,100,"Vertrieb_1","Hamburg",6,"2021-06-04",1]
[154,1,200,110,"Vertrieb_2","München",6,"2021-06-05",1]
[155,1,250,120,"Vertrieb_3","Köln",6,"2021-06-06",1]
[156,1,100,100,"Vertrieb_4","Frankfurt am Main",6,"2021-06-07",1]
[157,1,200,110,"Vertrieb_1","Hamburg",6,"2021-06-08",1]
[158,1,250,120,"Vertrieb_2","München",6,"2021-06-09",1]
[159,1,100,100,"Vertrieb_3","Köln",6,"2021-06-10",1]
[160,1,200,110,"Vertrieb_4","Frankfurt am Main",6,"2021-06-11",1]
[161,1,250,120,"Vertrieb_1","Hamburg",6,"2021-06-12",1]
[162,1,100,100,"Vertrieb_2","München",6,"2021-06-13",1]
[163,1,200,110,"Vertrieb_3","Köln",6,"2021-06-14",1]
[164,1,250,120,"Vertrieb_4","Frankfurt am Main",6,"2021-06-15",1]
[165,1,100,100,"Vertrieb_1","Hamburg",6,"2021-06-16",1]
[166,1,200,110,"Vertrieb_2","München",6,"2021-06-17",1]
[167,1,250,120,"Vertrieb_3","Köln",6,"2021-06-18",1]
[168,1,100,100,"Vertrieb_4","Frankfurt am Main",6,"2021-06-19",1]
[169,1,200,110,"Vertrieb_1","Hamburg",6,"2021-06-20",1]
[170,1,250,120,"Vertrieb_2","München",6,"2021-06-21",1]
[171,1,100,100,"Vertrieb_3","Köln",6,"2021-06-22",1]
[172,1,200,110,"Vertrieb_4","Frankfurt am Main",6,"2021-06-23",1]
[173,1,250,120,"Vertrieb_1","Hamburg",6,"2021-06-24",1]
[174,1,100,100,"Vertrieb_2","München",6,"2021-06-25",1]
[175,1,200,110,"Vertrieb_3","Köln",6,"2021-06-26",1]
[176,1,250,120,"Vertrieb_4","Frankfurt am Main",6,"2021-06-27",1]
[177,1,200,110,"Vertrieb_1","Hamburg",6,"2021-06-28",1]
[178,1,250,120,"Vertrieb_2","München",6,"2021-06-29",1]
[179,1,100,100,"Vertrieb_3","Köln",6,"2021-06-30",1]
[180,1,200,110,"Vertrieb_4","Frankfurt am Main",7,"2021-07-01",1]
[181,1,250,120,"Vertrieb_1","Hamburg",7,"2021-07-02",1]
[182,1,100,100,"Vertrieb_2","München",7,"2021-07-03",1]
[183,1,200,110,"Vertrieb_3","Köln",7,"2021-07-04",1]
[184,1,250,120,"Vertrieb_4","Frankfurt am Main",7,"2021-07-05",1]
[185,1,100,100,"Vertrieb_1","Hamburg",7,"2021-07-06",1]
[186,1,200,110,"Vertrieb_2","München",7,"2021-07-07",1]
[187,1,250,120,"Vertrieb_3","Köln",7,"2021-07-08",1]
[188,1,100,100,"Vertrieb_4","Frankfurt am Main",7,"2021-07-09",1]
[189,1,200,110,"Vertrieb_1","Hamburg",7,"2021-07-10",1]
[190,1,250,120,"Vertrieb_2","München",7,"2021-07-11",1]
[191,1,100,100,"Vertrieb_3","Köln",7,"2021-07-12",1]
[192,1,200,110,"Vertrieb_4","Frankfurt am Main",7,"2021-07-13",1]
[193,1,250,120,"Vertrieb_1","Hamburg",7,"2021-07-14",1]
[194,1,100,100,"Vertrieb_2","München",7,"2021-07-15",1]
[{"$f":"A195+1","v":195},1,200,110,"Vertrieb_3","Köln",7,"2021-07-16",1]
[196,1,250,120,"Vertrieb_4","Frankfurt am Main",7,"2021-07-17",1]
[197,1,100,100,"Vertrieb_1","Hamburg",7,"2021-07-18",1]
[198,1,200,110,"Vertrieb_2","München",7,"2021-07-19",1]
[199,1,250,120,"Vertrieb_3","Köln",7,"2021-07-20",1]
[200,1,100,100,"Vertrieb_4","Frankfurt am Main",7,"2021-07-21",1]
[201,1,200,110,"Vertrieb_1","Hamburg",7,"2021-07-22",1]
[202,1,250,120,"Vertrieb_2","München",7,"2021-07-23",1]
[203,1,100,100,"Vertrieb_3","Köln",7,"2021-07-24",1]
[204,1,200,110,"Vertrieb_4","Frankfurt am Main",7,"2021-07-25",1]
[205,1,250,120,"Vertrieb_1","Hamburg",7,"2021-07-26",1]
[206,1,100,100,"Vertrieb_2","München",7,"2021-07-27",1]
[207,1,200,110,"Vertrieb_3","Köln",7,"2021-07-28",1]
[208,1,100,100,"Vertrieb_4","Frankfurt am Main",7,"2021-07-29",1]
[209,1,200,110,"Vertrieb_1","Hamburg",7,"2021-07-30",1]
[210,1,250,120,"Vertrieb_2","München",7,"2021-07-31",1]
[211,1,100,100,"Vertrieb_3","Köln",8,"2021-08-01",1]
[212,1,200,110,"Vertrieb_4","Frankfurt am Main",8,"2021-08-02",1]
[213,1,250,120,"Vertrieb_1","Hamburg",8,"2021-08-03",1]
[214,1,100,100,"Vertrieb_2","München",8,"2021-08-04",1]
[215,1,200,110,"Vertrieb_3","Köln",8,"2021-08-05",1]
[216,1,250,120,"Vertrieb_4","Frankfurt am Main",8,"2021-08-06",1]
[217,1,100,100,"Vertrieb_1","Hamburg",8,"2021-08-07",1]
[218,1,200,110,"Vertrieb_2","München",8,"2021-08-08",1]
[219,1,250,120,"Vertrieb_3","Köln",8,"2021-08-09",1]
[220,1,100,100,"Vertrieb_4","Frankfurt am Main",8,"2021-08-10",1]
[221,1,200,110,"Vertrieb_1","Hamburg",8,"2021-08-11",1]
[222,1,250,120,"Vertrieb_2","München",8,"2021-08-12",1]
[223,1,100,100,"Vertrieb_3","Köln",8,"2021-08-13",1]
[224,1,200,110,"Vertrieb_4","Frankfurt am Main",8,"2021-08-14",1]
[225,1,250,120,"Vertrieb_1","Hamburg",8,"2021-08-15",1]
[226,1,100,100,"Vertrieb_2","München",8,"2021-08-16",1]
[227,1,200,110,"Vertrieb_3","Köln",8,"2021-08-17",1]
[228,1,250,120,"Vertrieb_4","Frankfurt am Main",8,"2021-08-18",1]
[229,1,100,100,"Vertrieb_1","Hamburg",8,"2021-08-19",1]
[230,1,200,110,"Vertrieb_2","München",8,"2021-08-20",1]
[231,1,250,120,"Vertrieb_3","Köln",8,"2021-08-21",1]
[232,1,100,100,"Vertrieb_4","Frankfurt am Main",8,"2021-08-22",1]
[233,1,200,110,"Vertrieb_1","Hamburg",8,"2021-08-23",1]
[234,1,250,120,"Vertrieb_2","München",8,"2021-08-24",1]
[235,1,100,100,"Vertrieb_3","Köln",8,"2021-08-25",1]
[236,1,200,110,"Vertrieb_4","Frankfurt am Main",8,"2021-08-26",1]
[237,1,250,120,"Vertrieb_1","Hamburg",8,"2021-08-27",1]
[238,1,100,100,"Vertrieb_2","München",8,"2021-08-28",1]
[239,1,100,100,"Vertrieb_3","Köln",8,"2021-08-29",1]
[240,1,200,110,"Vertrieb_4","Frankfurt am Main",8,"2021-08-30",1]
[241,1,250,120,"Vertrieb_1","Hamburg",8,"2021-08-31",1]
[242,1,100,100,"Vertrieb_2","München",9,"2021-09-01",1]
[243,1,200,110,"Vertrieb_3","Köln",9,"2021-09-02",1]
[244,1,250,120,"Vertrieb_4","Frankfurt am Main",9,"2021-09-03",1]
[245,1,100,100,"Vertrieb_1","Hamburg",9,"2021-09-04",1]
[246,1,200,110,"Vertrieb_2","München",9,"2021-09-05",1]
[247,1,250,120,"Vertrieb_3","Köln",9,"2021-09-06",1]
[248,1,100,100,"Vertrieb_4","Frankfurt am Main",9,"2021-09-07",1]
[249,1,200,110,"Vertrieb_1","Hamburg",9,"2021-09-08",1]
[250,1,250,120,"Vertrieb_2","München",9,"2021-09-09",1]
[251,1,100,100,"Vertrieb_3","Köln",9,"2021-09-10",1]
[252,1,200,110,"Vertrieb_4","Frankfurt am Main",9,"2021-09-11",1]
[253,1,250,120,"Vertrieb_1","Hamburg",9,"2021-09-12",1]
[254,1,100,100,"Vertrieb_2","München",9,"2021-09-13",1]
[255,1,200,110,"Vertrieb_3","Köln",9,"2021-09-14",1]
[256,1,250,120,"Vertrieb_4","Frankfurt am Main",9,"2021-09-15",1]
[257,1,100,100,"Vertrieb_1","Hamburg",9,"2021-09-16",1]
[258,1,200,110,"Vertrieb_2","München",9,"2021-09-17",1]
[{"$f":"A259+1","v":259},1,250,120,"Vertrieb_3","Köln",9,"2021-09-18",1]
[260,1,100,100,"Vertrieb_4","Frankfurt am Main",9,"2021-09-19",1]
[261,1,200,110,"Vertrieb_1","Hamburg",9,"2021-09-20",1]
[262,1,250,120,"Vertrieb_2","München",9,"2021-09-21",1]
[263,1,100,100,"Vertrieb_3","Köln",9,"2021-09-22",1]
[264,1,200,110,"Vertrieb_4","Frankfurt am Main",9,"2021-09-23",1]
[265,1,250,120,"Vertrieb_1","Hamburg",9,"2021-09-24",1]
[266,1,100,100,"Vertrieb_2","München",9,"2021-09-25",1]
[267,1,200,110,"Vertrieb_3","Köln",9,"2021-09-26",1]
[268,1,250,120,"Vertrieb_4","Frankfurt am Main",9,"2021-09-27",1]
[269,1,100,100,"Vertrieb_1","Hamburg",9,"2021-09-28",1]
[270,1,250,120,"Vertrieb_2","München",9,"2021-09-29",1]
[271,1,100,100,"Vertrieb_3","Köln",9,"2021-09-30",1]
[272,1,200,110,"Vertrieb_4","Frankfurt am Main",10,"2021-10-01",1]
[273,1,250,120,"Vertrieb_1","Hamburg",10,"2021-10-02",1]
[274,1,100,100,"Vertrieb_2","München",10,"2021-10-03",1]
[275,1,200,110,"Vertrieb_3","Köln",10,"2021-10-04",1]
[276,1,250,120,"Vertrieb_4","Frankfurt am Main",10,"2021-10-05",1]
[277,1,100,100,"Vertrieb_1","Hamburg",10,"2021-10-06",1]
[278,1,200,110,"Vertrieb_2","München",10,"2021-10-07",1]
[279,1,250,120,"Vertrieb_3","Köln",10,"2021-10-08",1]
[280,1,100,100,"Vertrieb_4","Frankfurt am Main",10,"2021-10-09",1]
[281,1,200,110,"Vertrieb_1","Hamburg",10,"2021-10-10",1]
[282,1,250,120,"Vertrieb_2","München",10,"2021-10-11",1]
[283,1,100,100,"Vertrieb_3","Köln",10,"2021-10-12",1]
[284,1,200,110,"Vertrieb_4","Frankfurt am Main",10,"2021-10-13",1]
[285,1,250,120,"Vertrieb_1","Hamburg",10,"2021-10-14",1]
[286,1,100,100,"Vertrieb_2","München",10,"2021-10-15",1]
[287,1,200,110,"Vertrieb_3","Köln",10,"2021-10-16",1]
[288,1,250,120,"Vertrieb_4","Frankfurt am Main",10,"2021-10-17",1]
[289,1,100,100,"Vertrieb_1","Hamburg",10,"2021-10-18",1]
[290,1,200,110,"Vertrieb_2","München",10,"2021-10-19",1]
[291,1,250,120,"Vertrieb_3","Köln",10,"2021-10-20",1]
[292,1,100,100,"Vertrieb_4","Frankfurt am Main",10,"2021-10-21",1]
[293,1,200,110,"Vertrieb_1","Hamburg",10,"2021-10-22",1]
[294,1,250,120,"Vertrieb_2","München",10,"2021-10-23",1]
[295,1,100,100,"Vertrieb_3","Köln",10,"2021-10-24",1]
[296,1,200,110,"Vertrieb_4","Frankfurt am Main",10,"2021-10-25",1]
[297,1,250,120,"Vertrieb_1","Hamburg",10,"2021-10-26",1]
[298,1,100,100,"Vertrieb_2","München",10,"2021-10-27",1]
[299,1,200,110,"Vertrieb_3","Köln",10,"2021-10-28",1]
[300,1,250,120,"Vertrieb_4","Frankfurt am Main",10,"2021-10-29",1]
[301,1,200,110,"Vertrieb_1","Hamburg",10,"2021-10-30",1]
[302,1,250,120,"Vertrieb_2","München",10,"2021-10-31",1]
[303,1,100,100,"Vertrieb_3","Köln",11,"2021-11-01",1]
[304,1,200,110,"Vertrieb_4","Frankfurt am Main",11,"2021-11-02",1]
[305,1,250,120,"Vertrieb_1","Hamburg",11,"2021-11-03",1]
[306,1,100,100,"Vertrieb_2","München",11,"2021-11-04",1]
[307,1,200,110,"Vertrieb_3","Köln",11,"2021-11-05",1]
[308,1,250,120,"Vertrieb_4","Frankfurt am Main",11,"2021-11-06",1]
[309,1,100,100,"Vertrieb_1","Hamburg",11,"2021-11-07",1]
[310,1,200,110,"Vertrieb_2","München",11,"2021-11-08",1]
[311,1,250,120,"Vertrieb_3","Köln",11,"2021-11-09",1]
[312,1,100,100,"Vertrieb_4","Frankfurt am Main",11,"2021-11-10",1]
[313,1,200,110,"Vertrieb_1","Hamburg",11,"2021-11-11",1]
[314,1,250,120,"Vertrieb_2","München",11,"2021-11-12",1]
[315,1,100,100,"Vertrieb_3","Köln",11,"2021-11-13",1]
[316,1,200,110,"Vertrieb_4","Frankfurt am Main",11,"2021-11-14",1]
[317,1,250,120,"Vertrieb_1","Hamburg",11,"2021-11-15",1]
[318,1,100,100,"Vertrieb_2","München",11,"2021-11-16",1]
[319,1,200,110,"Vertrieb_3","Köln",11,"2021-11-17",1]
[320,1,250,120,"Vertrieb_4","Frankfurt am Main",11,"2021-11-18",1]
[321,1,100,100,"Vertrieb_1","Hamburg",11,"2021-11-19",1]
[322,1,200,110,"Vertrieb_2","München",11,"2021-11-20",1]
[{"$f":"A323+1","v":323},1,250,120,"Vertrieb_3","Köln",11,"2021-11-21",1]
[324,1,100,100,"Vertrieb_4","Frankfurt am Main",11,"2021-11-22",1]
[325,1,200,110,"Vertrieb_1","Hamburg",11,"2021-11-23",1]
[326,1,250,120,"Vertrieb_2","München",11,"2021-11-24",1]
[327,1,100,100,"Vertrieb_3","Köln",11,"2021-11-25",1]
[328,1,200,110,"Vertrieb_4","Frankfurt am Main",11,"2021-11-26",1]
[329,1,250,120,"Vertrieb_1","Hamburg",11,"2021-11-27",1]
[330,1,100,100,"Vertrieb_2","München",11,"2021-11-28",1]
[331,1,200,110,"Vertrieb_3","Köln",11,"2021-11-29",1]
[332,1,100,100,"Vertrieb_4","Frankfurt am Main",11,"2021-11-30",1]
[333,1,200,110,"Vertrieb_1","Hamburg",12,"2021-12-01",1]
[334,1,250,120,"Vertrieb_2","München",12,"2021-12-02",1]
[335,1,100,100,"Vertrieb_3","Köln",12,"2021-12-03",1]
[336,1,200,110,"Vertrieb_4","Frankfurt am Main",12,"2021-12-04",1]
[337,1,250,120,"Vertrieb_1","Hamburg",12,"2021-12-05",1]
[338,1,100,100,"Vertrieb_2","München",12,"2021-12-06",1]
[339,1,200,110,"Vertrieb_3","Köln",12,"2021-12-07",1]
[340,1,250,120,"Vertrieb_4","Frankfurt am Main",12,"2021-12-08",1]
[341,1,100,100,"Vertrieb_1","Hamburg",12,"2021-12-09",1]
[342,1,200,110,"Vertrieb_2","München",12,"2021-12-10",1]
[343,1,250,120,"Vertrieb_3","Köln",12,"2021-12-11",1]
[344,1,100,100,"Vertrieb_4","Frankfurt am Main",12,"2021-12-12",1]
[345,1,200,110,"Vertrieb_1","Hamburg",12,"2021-12-13",1]
[346,1,250,120,"Vertrieb_2","München",12,"2021-12-14",1]
[347,1,100,100,"Vertrieb_3","Köln",12,"2021-12-15",1]
[348,1,200,110,"Vertrieb_4","Frankfurt am Main",12,"2021-12-16",1]
[349,1,250,120,"Vertrieb_1","Hamburg",12,"2021-12-17",1]
[350,1,100,100,"Vertrieb_2","München",12,"2021-12-18",1]
[351,1,200,110,"Vertrieb_3","Köln",12,"2021-12-19",1]
[352,1,250,120,"Vertrieb_4","Frankfurt am Main",12,"2021-12-20",1]
[353,1,100,100,"Vertrieb_1","Hamburg",12,"2021-12-21",1]
[354,1,200,110,"Vertrieb_2","München",12,"2021-12-22",1]
[355,1,250,120,"Vertrieb_3","Köln",12,"2021-12-23",1]
[356,1,100,100,"Vertrieb_4","Frankfurt am Main",12,"2021-12-24",1]
[357,1,200,110,"Vertrieb_1","Hamburg",12,"2021-12-25",1]
[358,1,250,120,"Vertrieb_2","München",12,"2021-12-26",1]
[359,1,100,100,"Vertrieb_3","Köln",12,"2021-12-27",1]
[360,1,200,110,"Vertrieb_4","Frankfurt am Main",12,"2021-12-28",1]
[361,1,250,120,"Vertrieb_1","Hamburg",12,"2021-12-29",1]
[362,1,100,100,"Vertrieb_2","München",12,"2021-12-30",1]
[363,1,100,100,"Vertrieb_3","Köln",12,"2021-12-31",1]
[null,null,{"$f":"SUM(C2:C364)","v":66300},null,null,null,null,null,{"$f":"SUM(I2:I364)","v":363}]

{"sheet":"Excel_Tabellenblatt_Microsoft B","index":7,"n_rows":0,"n_cols":0,"rows_kept":0,"cut":false,"hidden":false,"merged":[]}

{"sheet":"Pivot_Umsatz_Produkt_Region","index":8,"n_rows":8,"n_cols":6,"rows_kept":8,"cut":false,"hidden":false,"merged":[]}
[]
[]
["Summe von Umsatz","Spaltenbeschriftungen"]
["Zeilenbeschriftungen","Frankfurt am Main","Hamburg","Köln","München","Gesamtergebnis"]
[100,2800,2600,3500,3400,12300]
[110,6800,6200,6200,4800,24000]
[120,7000,8500,6250,8250,30000]
["Gesamtergebnis",16600,17300,15950,16450,66300]

{"sheet":"Pivot_Umsatz_Vertrieb","index":9,"n_rows":9,"n_cols":5,"rows_kept":9,"cut":false,"hidden":false,"merged":[]}
[]
[]
["Summe von Umsatz","Spaltenbeschriftungen"]
["Zeilenbeschriftungen",100,110,120,"Gesamtergebnis"]
["Vertrieb_1",2600,6200,8500,17300]
["Vertrieb_2",3400,4800,8250,16450]
["Vertrieb_3",3500,6200,6250,15950]
["Vertrieb_4",2800,6800,7000,16600]
["Gesamtergebnis",12300,24000,30000,66300]

{"sheet":"Pivot_Umsatz_Ort","index":10,"n_rows":8,"n_cols":3,"rows_kept":8,"cut":false,"hidden":false,"merged":[]}
[]
[]
["Zeilenbeschriftungen","Summe von Umsatz","Summe von Anzahl"]
["Frankfurt am Main",16600,90]
["Hamburg",17300,91]
["Köln",15950,91]
["München",16450,91]
["Gesamtergebnis",66300,363]

{"sheet":"Vorlage_TE","index":11,"n_rows":364,"n_cols":8,"rows_kept":364,"cut":false,"hidden":false,"merged":[]}
["lfd. Nr.","Anzahl","Umsatz","Produkt","Vertrieb","Ort","Monat","Datum"]
[1,1,100,100,"Vertrieb_1","Hamburg",1,"2021-01-03"]
[2,1,200,110,"Vertrieb_2","München",1,"2021-01-04"]
[3,1,250,120,"Vertrieb_3","Köln",1,"2021-01-05"]
[4,1,100,100,"Vertrieb_4","Frankfurt am Main",1,"2021-01-06"]
[5,1,200,110,"Vertrieb_1","Hamburg",1,"2021-01-07"]
[6,1,200,110,"Vertrieb_2","München",1,"2021-01-08"]
[7,1,250,120,"Vertrieb_3","Köln",1,"2021-01-09"]
[8,1,100,100,"Vertrieb_4","Frankfurt am Main",1,"2021-01-10"]
[9,1,200,110,"Vertrieb_1","Hamburg",1,"2021-01-11"]
[10,1,250,120,"Vertrieb_2","München",1,"2021-01-12"]
[11,1,250,120,"Vertrieb_3","Köln",1,"2021-01-13"]
[12,1,100,100,"Vertrieb_4","Frankfurt am Main",1,"2021-01-14"]
[13,1,200,110,"Vertrieb_1","Hamburg",1,"2021-01-15"]
[14,1,250,120,"Vertrieb_2","München",1,"2021-01-16"]
[15,1,100,100,"Vertrieb_3","Köln",1,"2021-01-17"]
[16,1,200,110,"Vertrieb_4","Frankfurt am Main",1,"2021-01-18"]
[17,1,250,120,"Vertrieb_1","Hamburg",1,"2021-01-19"]
[18,1,100,100,"Vertrieb_2","München",1,"2021-01-20"]
[19,1,200,110,"Vertrieb_3","Köln",1,"2021-01-21"]
[20,1,250,120,"Vertrieb_4","Frankfurt am Main",1,"2021-01-22"]
[21,1,100,100,"Vertrieb_1","Hamburg",1,"2021-01-23"]
[22,1,250,120,"Vertrieb_2","München",1,"2021-01-24"]
[23,1,100,100,"Vertrieb_3","Köln",1,"2021-01-25"]
[24,1,200,110,"Vertrieb_4","Frankfurt am Main",1,"2021-01-26"]
[25,1,250,120,"Vertrieb_1","Hamburg",1,"2021-01-27"]
[26,1,100,100,"Vertrieb_2","München",1,"2021-01-28"]
[27,1,200,110,"Vertrieb_3","Köln",1,"2021-01-29"]
[28,1,250,120,"Vertrieb_4","Frankfurt am Main",1,"2021-01-30"]
[29,1,100,100,"Vertrieb_1","Hamburg",1,"2021-01-31"]
[30,1,200,110,"Vertrieb_2","München",2,"2021-02-01"]
[31,1,250,120,"Vertrieb_3","Köln",2,"2021-02-02"]
[32,1,100,100,"Vertrieb_4","Frankfurt am Main",2,"2021-02-03"]
[33,1,200,110,"Vertrieb_1","Hamburg",2,"2021-02-04"]
[34,1,250,120,"Vertrieb_2","München",2,"2021-02-05"]
[35,1,100,100,"Vertrieb_3","Köln",2,"2021-02-06"]
[36,1,200,110,"Vertrieb_4","Frankfurt am Main",2,"2021-02-07"]
[37,1,250,120,"Vertrieb_1","Hamburg",2,"2021-02-08"]
[38,1,100,100,"Vertrieb_2","München",2,"2021-02-09"]
[39,1,200,110,"Vertrieb_3","Köln",2,"2021-02-10"]
[40,1,250,120,"Vertrieb_4","Frankfurt am Main",2,"2021-02-11"]
[41,1,100,100,"Vertrieb_1","Hamburg",2,"2021-02-12"]
[42,1,200,110,"Vertrieb_2","München",2,"2021-02-13"]
[43,1,250,120,"Vertrieb_3","Köln",2,"2021-02-14"]
[44,1,100,100,"Vertrieb_4","Frankfurt am Main",2,"2021-02-15"]
[45,1,200,110,"Vertrieb_1","Hamburg",2,"2021-02-16"]
[46,1,250,120,"Vertrieb_2","München",2,"2021-02-17"]
[47,1,100,100,"Vertrieb_3","Köln",2,"2021-02-18"]
[48,1,200,110,"Vertrieb_4","Frankfurt am Main",2,"2021-02-19"]
[49,1,250,120,"Vertrieb_1","Hamburg",2,"2021-02-20"]
[50,1,100,100,"Vertrieb_2","München",2,"2021-02-21"]
[51,1,200,110,"Vertrieb_3","Köln",2,"2021-02-22"]
[52,1,250,120,"Vertrieb_4","Frankfurt am Main",2,"2021-02-23"]
[53,1,200,110,"Vertrieb_1","Hamburg",2,"2021-02-24"]
[54,1,250,120,"Vertrieb_2","München",2,"2021-02-25"]
[55,1,100,100,"Vertrieb_3","Köln",2,"2021-02-26"]
[56,1,200,110,"Vertrieb_4","Frankfurt am Main",2,"2021-02-27"]
[57,1,250,120,"Vertrieb_1","Hamburg",2,"2021-02-28"]
[58,1,100,100,"Vertrieb_2","München",3,"2021-03-01"]
[59,1,200,110,"Vertrieb_3","Köln",3,"2021-03-02"]
[60,1,250,120,"Vertrieb_4","Frankfurt am Main",3,"2021-03-03"]
[61,1,100,100,"Vertrieb_1","Hamburg",3,"2021-03-04"]
[62,1,200,110,"Vertrieb_2","München",3,"2021-03-05"]
[63,1,250,120,"Vertrieb_3","Köln",3,"2021-03-06"]
[64,1,100,100,"Vertrieb_4","Frankfurt am Main",3,"2021-03-07"]
[65,1,200,110,"Vertrieb_1","Hamburg",3,"2021-03-08"]
[66,1,250,120,"Vertrieb_2","München",3,"2021-03-09"]
[67,1,100,100,"Vertrieb_3","Köln",3,"2021-03-10"]
[68,1,200,110,"Vertrieb_4","Frankfurt am Main",3,"2021-03-11"]
[69,1,250,120,"Vertrieb_1","Hamburg",3,"2021-03-12"]
[70,1,100,100,"Vertrieb_2","München",3,"2021-03-13"]
[71,1,200,110,"Vertrieb_3","Köln",3,"2021-03-14"]
[72,1,250,120,"Vertrieb_4","Frankfurt am Main",3,"2021-03-15"]
[73,1,100,100,"Vertrieb_1","Hamburg",3,"2021-03-16"]
[74,1,200,110,"Vertrieb_2","München",3,"2021-03-17"]
[75,1,250,120,"Vertrieb_3","Köln",3,"2021-03-18"]
[76,1,100,100,"Vertrieb_4","Frankfurt am Main",3,"2021-03-19"]
[77,1,200,110,"Vertrieb_1","Hamburg",3,"2021-03-20"]
[78,1,250,120,"Vertrieb_2","München",3,"2021-03-21"]
[79,1,100,100,"Vertrieb_3","Köln",3,"2021-03-22"]
[80,1,200,110,"Vertrieb_4","Frankfurt am Main",3,"2021-03-23"]
[81,1,250,120,"Vertrieb_1","Hamburg",3,"2021-03-24"]
[82,1,100,100,"Vertrieb_2","München",3,"2021-03-25"]
[83,1,200,110,"Vertrieb_3","Köln",3,"2021-03-26"]
[84,1,100,100,"Vertrieb_4","Frankfurt am Main",3,"2021-03-27"]
[85,1,200,110,"Vertrieb_1","Hamburg",3,"2021-03-28"]
[86,1,250,120,"Vertrieb_2","München",3,"2021-03-29"]
[87,1,100,100,"Vertrieb_3","Köln",3,"2021-03-30"]
[88,1,200,110,"Vertrieb_4","Frankfurt am Main",3,"2021-03-31"]
[89,1,250,120,"Vertrieb_1","Hamburg",4,"2021-04-01"]
[90,1,100,100,"Vertrieb_2","München",4,"2021-04-02"]
[91,1,200,110,"Vertrieb_3","Köln",4,"2021-04-03"]
[92,1,250,120,"Vertrieb_4","Frankfurt am Main",4,"2021-04-04"]
[93,1,100,100,"Vertrieb_1","Hamburg",4,"2021-04-05"]
[94,1,200,110,"Vertrieb_2","München",4,"2021-04-06"]
[95,1,250,120,"Vertrieb_3","Köln",4,"2021-04-07"]
[96,1,100,100,"Vertrieb_4","Frankfurt am Main",4,"2021-04-08"]
[97,1,200,110,"Vertrieb_1","Hamburg",4,"2021-04-09"]
[98,1,250,120,"Vertrieb_2","München",4,"2021-04-10"]
[99,1,100,100,"Vertrieb_3","Köln",4,"2021-04-11"]
[100,1,200,110,"Vertrieb_4","Frankfurt am Main",4,"2021-04-12"]
[101,1,250,120,"Vertrieb_1","Hamburg",4,"2021-04-13"]
[102,1,100,100,"Vertrieb_2","München",4,"2021-04-14"]
[103,1,200,110,"Vertrieb_3","Köln",4,"2021-04-15"]
[104,1,250,120,"Vertrieb_4","Frankfurt am Main",4,"2021-04-16"]
[105,1,100,100,"Vertrieb_1","Hamburg",4,"2021-04-17"]
[106,1,200,110,"Vertrieb_2","München",4,"2021-04-18"]
[107,1,250,120,"Vertrieb_3","Köln",4,"2021-04-19"]
[108,1,100,100,"Vertrieb_4","Frankfurt am Main",4,"2021-04-20"]
[109,1,200,110,"Vertrieb_1","Hamburg",4,"2021-04-21"]
[110,1,250,120,"Vertrieb_2","München",4,"2021-04-22"]
[111,1,100,100,"Vertrieb_3","Köln",4,"2021-04-23"]
[112,1,200,110,"Vertrieb_4","Frankfurt am Main",4,"2021-04-24"]
[113,1,250,120,"Vertrieb_1","Hamburg",4,"2021-04-25"]
[114,1,100,100,"Vertrieb_2","München",4,"2021-04-26"]
[115,1,100,100,"Vertrieb_3","Köln",4,"2021-04-27"]
[116,1,200,110,"Vertrieb_4","Frankfurt am Main",4,"2021-04-28"]
[117,1,250,120,"Vertrieb_1","Hamburg",4,"2021-04-29"]
[118,1,100,100,"Vertrieb_2","München",4,"2021-04-30"]
[119,1,200,110,"Vertrieb_3","Köln",5,"2021-05-01"]
[120,1,250,120,"Vertrieb_4","Frankfurt am Main",5,"2021-05-02"]
[121,1,100,100,"Vertrieb_1","Hamburg",5,"2021-05-03"]
[122,1,200,110,"Vertrieb_2","München",5,"2021-05-04"]
[123,1,250,120,"Vertrieb_3","Köln",5,"2021-05-05"]
[124,1,100,100,"Vertrieb_4","Frankfurt am Main",5,"2021-05-06"]
[125,1,200,110,"Vertrieb_1","Hamburg",5,"2021-05-07"]
[126,1,250,120,"Vertrieb_2","München",5,"2021-05-08"]
[127,1,100,100,"Vertrieb_3","Köln",5,"2021-05-09"]
[128,1,200,110,"Vertrieb_4","Frankfurt am Main",5,"2021-05-10"]
[129,1,250,120,"Vertrieb_1","Hamburg",5,"2021-05-11"]
[130,1,100,100,"Vertrieb_2","München",5,"2021-05-12"]
[131,1,200,110,"Vertrieb_3","Köln",5,"2021-05-13"]
[132,1,250,120,"Vertrieb_4","Frankfurt am Main",5,"2021-05-14"]
[133,1,100,100,"Vertrieb_1","Hamburg",5,"2021-05-15"]
[134,1,200,110,"Vertrieb_2","München",5,"2021-05-16"]
[135,1,250,120,"Vertrieb_3","Köln",5,"2021-05-17"]
[136,1,100,100,"Vertrieb_4","Frankfurt am Main",5,"2021-05-18"]
[137,1,200,110,"Vertrieb_1","Hamburg",5,"2021-05-19"]
[138,1,250,120,"Vertrieb_2","München",5,"2021-05-20"]
[139,1,100,100,"Vertrieb_3","Köln",5,"2021-05-21"]
[140,1,200,110,"Vertrieb_4","Frankfurt am Main",5,"2021-05-22"]
[141,1,250,120,"Vertrieb_1","Hamburg",5,"2021-05-23"]
[142,1,100,100,"Vertrieb_2","München",5,"2021-05-24"]
[143,1,200,110,"Vertrieb_3","Köln",5,"2021-05-25"]
[144,1,250,120,"Vertrieb_4","Frankfurt am Main",5,"2021-05-26"]
[145,1,100,100,"Vertrieb_1","Hamburg",5,"2021-05-27"]
[146,1,250,120,"Vertrieb_2","München",5,"2021-05-28"]
[147,1,100,100,"Vertrieb_3","Köln",5,"2021-05-29"]
[148,1,200,110,"Vertrieb_4","Frankfurt am Main",5,"2021-05-30"]
[149,1,250,120,"Vertrieb_1","Hamburg",5,"2021-05-31"]
[150,1,100,100,"Vertrieb_2","München",6,"2021-06-01"]
[151,1,200,110,"Vertrieb_3","Köln",6,"2021-06-02"]
[152,1,250,120,"Vertrieb_4","Frankfurt am Main",6,"2021-06-03"]
[153,1,100,100,"Vertrieb_1","Hamburg",6,"2021-06-04"]
[154,1,200,110,"Vertrieb_2","München",6,"2021-06-05"]
[155,1,250,120,"Vertrieb_3","Köln",6,"2021-06-06"]
[156,1,100,100,"Vertrieb_4","Frankfurt am Main",6,"2021-06-07"]
[157,1,200,110,"Vertrieb_1","Hamburg",6,"2021-06-08"]
[158,1,250,120,"Vertrieb_2","München",6,"2021-06-09"]
[159,1,100,100,"Vertrieb_3","Köln",6,"2021-06-10"]
[160,1,200,110,"Vertrieb_4","Frankfurt am Main",6,"2021-06-11"]
[161,1,250,120,"Vertrieb_1","Hamburg",6,"2021-06-12"]
[162,1,100,100,"Vertrieb_2","München",6,"2021-06-13"]
[163,1,200,110,"Vertrieb_3","Köln",6,"2021-06-14"]
[164,1,250,120,"Vertrieb_4","Frankfurt am Main",6,"2021-06-15"]
[165,1,100,100,"Vertrieb_1","Hamburg",6,"2021-06-16"]
[166,1,200,110,"Vertrieb_2","München",6,"2021-06-17"]
[167,1,250,120,"Vertrieb_3","Köln",6,"2021-06-18"]
[168,1,100,100,"Vertrieb_4","Frankfurt am Main",6,"2021-06-19"]
[169,1,200,110,"Vertrieb_1","Hamburg",6,"2021-06-20"]
[170,1,250,120,"Vertrieb_2","München",6,"2021-06-21"]
[171,1,100,100,"Vertrieb_3","Köln",6,"2021-06-22"]
[172,1,200,110,"Vertrieb_4","Frankfurt am Main",6,"2021-06-23"]
[173,1,250,120,"Vertrieb_1","Hamburg",6,"2021-06-24"]
[174,1,100,100,"Vertrieb_2","München",6,"2021-06-25"]
[175,1,200,110,"Vertrieb_3","Köln",6,"2021-06-26"]
[176,1,250,120,"Vertrieb_4","Frankfurt am Main",6,"2021-06-27"]
[177,1,200,110,"Vertrieb_1","Hamburg",6,"2021-06-28"]
[178,1,250,120,"Vertrieb_2","München",6,"2021-06-29"]
[179,1,100,100,"Vertrieb_3","Köln",6,"2021-06-30"]
[180,1,200,110,"Vertrieb_4","Frankfurt am Main",7,"2021-07-01"]
[181,1,250,120,"Vertrieb_1","Hamburg",7,"2021-07-02"]
[182,1,100,100,"Vertrieb_2","München",7,"2021-07-03"]
[183,1,200,110,"Vertrieb_3","Köln",7,"2021-07-04"]
[184,1,250,120,"Vertrieb_4","Frankfurt am Main",7,"2021-07-05"]
[185,1,100,100,"Vertrieb_1","Hamburg",7,"2021-07-06"]
[186,1,200,110,"Vertrieb_2","München",7,"2021-07-07"]
[187,1,250,120,"Vertrieb_3","Köln",7,"2021-07-08"]
[188,1,100,100,"Vertrieb_4","Frankfurt am Main",7,"2021-07-09"]
[189,1,200,110,"Vertrieb_1","Hamburg",7,"2021-07-10"]
[190,1,250,120,"Vertrieb_2","München",7,"2021-07-11"]
[191,1,100,100,"Vertrieb_3","Köln",7,"2021-07-12"]
[192,1,200,110,"Vertrieb_4","Frankfurt am Main",7,"2021-07-13"]
[193,1,250,120,"Vertrieb_1","Hamburg",7,"2021-07-14"]
[194,1,100,100,"Vertrieb_2","München",7,"2021-07-15"]
[195,1,200,110,"Vertrieb_3","Köln",7,"2021-07-16"]
[196,1,250,120,"Vertrieb_4","Frankfurt am Main",7,"2021-07-17"]
[197,1,100,100,"Vertrieb_1","Hamburg",7,"2021-07-18"]
[198,1,200,110,"Vertrieb_2","München",7,"2021-07-19"]
[199,1,250,120,"Vertrieb_3","Köln",7,"2021-07-20"]
[200,1,100,100,"Vertrieb_4","Frankfurt am Main",7,"2021-07-21"]
[201,1,200,110,"Vertrieb_1","Hamburg",7,"2021-07-22"]
[202,1,250,120,"Vertrieb_2","München",7,"2021-07-23"]
[203,1,100,100,"Vertrieb_3","Köln",7,"2021-07-24"]
[204,1,200,110,"Vertrieb_4","Frankfurt am Main",7,"2021-07-25"]
[205,1,250,120,"Vertrieb_1","Hamburg",7,"2021-07-26"]
[206,1,100,100,"Vertrieb_2","München",7,"2021-07-27"]
[207,1,200,110,"Vertrieb_3","Köln",7,"2021-07-28"]
[208,1,100,100,"Vertrieb_4","Frankfurt am Main",7,"2021-07-29"]
[209,1,200,110,"Vertrieb_1","Hamburg",7,"2021-07-30"]
[210,1,250,120,"Vertrieb_2","München",7,"2021-07-31"]
[211,1,100,100,"Vertrieb_3","Köln",8,"2021-08-01"]
[212,1,200,110,"Vertrieb_4","Frankfurt am Main",8,"2021-08-02"]
[213,1,250,120,"Vertrieb_1","Hamburg",8,"2021-08-03"]
[214,1,100,100,"Vertrieb_2","München",8,"2021-08-04"]
[215,1,200,110,"Vertrieb_3","Köln",8,"2021-08-05"]
[216,1,250,120,"Vertrieb_4","Frankfurt am Main",8,"2021-08-06"]
[217,1,100,100,"Vertrieb_1","Hamburg",8,"2021-08-07"]
[218,1,200,110,"Vertrieb_2","München",8,"2021-08-08"]
[219,1,250,120,"Vertrieb_3","Köln",8,"2021-08-09"]
[220,1,100,100,"Vertrieb_4","Frankfurt am Main",8,"2021-08-10"]
[221,1,200,110,"Vertrieb_1","Hamburg",8,"2021-08-11"]
[222,1,250,120,"Vertrieb_2","München",8,"2021-08-12"]
[223,1,100,100,"Vertrieb_3","Köln",8,"2021-08-13"]
[224,1,200,110,"Vertrieb_4","Frankfurt am Main",8,"2021-08-14"]
[225,1,250,120,"Vertrieb_1","Hamburg",8,"2021-08-15"]
[226,1,100,100,"Vertrieb_2","München",8,"2021-08-16"]
[227,1,200,110,"Vertrieb_3","Köln",8,"2021-08-17"]
[228,1,250,120,"Vertrieb_4","Frankfurt am Main",8,"2021-08-18"]
[229,1,100,100,"Vertrieb_1","Hamburg",8,"2021-08-19"]
[230,1,200,110,"Vertrieb_2","München",8,"2021-08-20"]
[231,1,250,120,"Vertrieb_3","Köln",8,"2021-08-21"]
[232,1,100,100,"Vertrieb_4","Frankfurt am Main",8,"2021-08-22"]
[233,1,200,110,"Vertrieb_1","Hamburg",8,"2021-08-23"]
[234,1,250,120,"Vertrieb_2","München",8,"2021-08-24"]
[235,1,100,100,"Vertrieb_3","Köln",8,"2021-08-25"]
[236,1,200,110,"Vertrieb_4","Frankfurt am Main",8,"2021-08-26"]
[237,1,250,120,"Vertrieb_1","Hamburg",8,"2021-08-27"]
[238,1,100,100,"Vertrieb_2","München",8,"2021-08-28"]
[239,1,100,100,"Vertrieb_3","Köln",8,"2021-08-29"]
[240,1,200,110,"Vertrieb_4","Frankfurt am Main",8,"2021-08-30"]
[241,1,250,120,"Vertrieb_1","Hamburg",8,"2021-08-31"]
[242,1,100,100,"Vertrieb_2","München",9,"2021-09-01"]
[243,1,200,110,"Vertrieb_3","Köln",9,"2021-09-02"]
[244,1,250,120,"Vertrieb_4","Frankfurt am Main",9,"2021-09-03"]
[245,1,100,100,"Vertrieb_1","Hamburg",9,"2021-09-04"]
[246,1,200,110,"Vertrieb_2","München",9,"2021-09-05"]
[247,1,250,120,"Vertrieb_3","Köln",9,"2021-09-06"]
[248,1,100,100,"Vertrieb_4","Frankfurt am Main",9,"2021-09-07"]
[249,1,200,110,"Vertrieb_1","Hamburg",9,"2021-09-08"]
[250,1,250,120,"Vertrieb_2","München",9,"2021-09-09"]
[251,1,100,100,"Vertrieb_3","Köln",9,"2021-09-10"]
[252,1,200,110,"Vertrieb_4","Frankfurt am Main",9,"2021-09-11"]
[253,1,250,120,"Vertrieb_1","Hamburg",9,"2021-09-12"]
[254,1,100,100,"Vertrieb_2","München",9,"2021-09-13"]
[255,1,200,110,"Vertrieb_3","Köln",9,"2021-09-14"]
[256,1,250,120,"Vertrieb_4","Frankfurt am Main",9,"2021-09-15"]
[257,1,100,100,"Vertrieb_1","Hamburg",9,"2021-09-16"]
[258,1,200,110,"Vertrieb_2","München",9,"2021-09-17"]
[259,1,250,120,"Vertrieb_3","Köln",9,"2021-09-18"]
[260,1,100,100,"Vertrieb_4","Frankfurt am Main",9,"2021-09-19"]
[261,1,200,110,"Vertrieb_1","Hamburg",9,"2021-09-20"]
[262,1,250,120,"Vertrieb_2","München",9,"2021-09-21"]
[263,1,100,100,"Vertrieb_3","Köln",9,"2021-09-22"]
[264,1,200,110,"Vertrieb_4","Frankfurt am Main",9,"2021-09-23"]
[265,1,250,120,"Vertrieb_1","Hamburg",9,"2021-09-24"]
[266,1,100,100,"Vertrieb_2","München",9,"2021-09-25"]
[267,1,200,110,"Vertrieb_3","Köln",9,"2021-09-26"]
[268,1,250,120,"Vertrieb_4","Frankfurt am Main",9,"2021-09-27"]
[269,1,100,100,"Vertrieb_1","Hamburg",9,"2021-09-28"]
[270,1,250,120,"Vertrieb_2","München",9,"2021-09-29"]
[271,1,100,100,"Vertrieb_3","Köln",9,"2021-09-30"]
[272,1,200,110,"Vertrieb_4","Frankfurt am Main",10,"2021-10-01"]
[273,1,250,120,"Vertrieb_1","Hamburg",10,"2021-10-02"]
[274,1,100,100,"Vertrieb_2","München",10,"2021-10-03"]
[275,1,200,110,"Vertrieb_3","Köln",10,"2021-10-04"]
[276,1,250,120,"Vertrieb_4","Frankfurt am Main",10,"2021-10-05"]
[277,1,100,100,"Vertrieb_1","Hamburg",10,"2021-10-06"]
[278,1,200,110,"Vertrieb_2","München",10,"2021-10-07"]
[279,1,250,120,"Vertrieb_3","Köln",10,"2021-10-08"]
[280,1,100,100,"Vertrieb_4","Frankfurt am Main",10,"2021-10-09"]
[281,1,200,110,"Vertrieb_1","Hamburg",10,"2021-10-10"]
[282,1,250,120,"Vertrieb_2","München",10,"2021-10-11"]
[283,1,100,100,"Vertrieb_3","Köln",10,"2021-10-12"]
[284,1,200,110,"Vertrieb_4","Frankfurt am Main",10,"2021-10-13"]
[285,1,250,120,"Vertrieb_1","Hamburg",10,"2021-10-14"]
[286,1,100,100,"Vertrieb_2","München",10,"2021-10-15"]
[287,1,200,110,"Vertrieb_3","Köln",10,"2021-10-16"]
[288,1,250,120,"Vertrieb_4","Frankfurt am Main",10,"2021-10-17"]
[289,1,100,100,"Vertrieb_1","Hamburg",10,"2021-10-18"]
[290,1,200,110,"Vertrieb_2","München",10,"2021-10-19"]
[291,1,250,120,"Vertrieb_3","Köln",10,"2021-10-20"]
[292,1,100,100,"Vertrieb_4","Frankfurt am Main",10,"2021-10-21"]
[293,1,200,110,"Vertrieb_1","Hamburg",10,"2021-10-22"]
[294,1,250,120,"Vertrieb_2","München",10,"2021-10-23"]
[295,1,100,100,"Vertrieb_3","Köln",10,"2021-10-24"]
[296,1,200,110,"Vertrieb_4","Frankfurt am Main",10,"2021-10-25"]
[297,1,250,120,"Vertrieb_1","Hamburg",10,"2021-10-26"]
[298,1,100,100,"Vertrieb_2","München",10,"2021-10-27"]
[299,1,200,110,"Vertrieb_3","Köln",10,"2021-10-28"]
[300,1,250,120,"Vertrieb_4","Frankfurt am Main",10,"2021-10-29"]
[301,1,200,110,"Vertrieb_1","Hamburg",10,"2021-10-30"]
[302,1,250,120,"Vertrieb_2","München",10,"2021-10-31"]
[303,1,100,100,"Vertrieb_3","Köln",11,"2021-11-01"]
[304,1,200,110,"Vertrieb_4","Frankfurt am Main",11,"2021-11-02"]
[305,1,250,120,"Vertrieb_1","Hamburg",11,"2021-11-03"]
[306,1,100,100,"Vertrieb_2","München",11,"2021-11-04"]
[307,1,200,110,"Vertrieb_3","Köln",11,"2021-11-05"]
[308,1,250,120,"Vertrieb_4","Frankfurt am Main",11,"2021-11-06"]
[309,1,100,100,"Vertrieb_1","Hamburg",11,"2021-11-07"]
[310,1,200,110,"Vertrieb_2","München",11,"2021-11-08"]
[311,1,250,120,"Vertrieb_3","Köln",11,"2021-11-09"]
[312,1,100,100,"Vertrieb_4","Frankfurt am Main",11,"2021-11-10"]
[313,1,200,110,"Vertrieb_1","Hamburg",11,"2021-11-11"]
[314,1,250,120,"Vertrieb_2","München",11,"2021-11-12"]
[315,1,100,100,"Vertrieb_3","Köln",11,"2021-11-13"]
[316,1,200,110,"Vertrieb_4","Frankfurt am Main",11,"2021-11-14"]
[317,1,250,120,"Vertrieb_1","Hamburg",11,"2021-11-15"]
[318,1,100,100,"Vertrieb_2","München",11,"2021-11-16"]
[319,1,200,110,"Vertrieb_3","Köln",11,"2021-11-17"]
[320,1,250,120,"Vertrieb_4","Frankfurt am Main",11,"2021-11-18"]
[321,1,100,100,"Vertrieb_1","Hamburg",11,"2021-11-19"]
[322,1,200,110,"Vertrieb_2","München",11,"2021-11-20"]
[323,1,250,120,"Vertrieb_3","Köln",11,"2021-11-21"]
[324,1,100,100,"Vertrieb_4","Frankfurt am Main",11,"2021-11-22"]
[325,1,200,110,"Vertrieb_1","Hamburg",11,"2021-11-23"]
[326,1,250,120,"Vertrieb_2","München",11,"2021-11-24"]
[327,1,100,100,"Vertrieb_3","Köln",11,"2021-11-25"]
[328,1,200,110,"Vertrieb_4","Frankfurt am Main",11,"2021-11-26"]
[329,1,250,120,"Vertrieb_1","Hamburg",11,"2021-11-27"]
[330,1,100,100,"Vertrieb_2","München",11,"2021-11-28"]
[331,1,200,110,"Vertrieb_3","Köln",11,"2021-11-29"]
[332,1,100,100,"Vertrieb_4","Frankfurt am Main",11,"2021-11-30"]
[333,1,200,110,"Vertrieb_1","Hamburg",12,"2021-12-01"]
[334,1,250,120,"Vertrieb_2","München",12,"2021-12-02"]
[335,1,100,100,"Vertrieb_3","Köln",12,"2021-12-03"]
[336,1,200,110,"Vertrieb_4","Frankfurt am Main",12,"2021-12-04"]
[337,1,250,120,"Vertrieb_1","Hamburg",12,"2021-12-05"]
[338,1,100,100,"Vertrieb_2","München",12,"2021-12-06"]
[339,1,200,110,"Vertrieb_3","Köln",12,"2021-12-07"]
[340,1,250,120,"Vertrieb_4","Frankfurt am Main",12,"2021-12-08"]
[341,1,100,100,"Vertrieb_1","Hamburg",12,"2021-12-09"]
[342,1,200,110,"Vertrieb_2","München",12,"2021-12-10"]
[343,1,250,120,"Vertrieb_3","Köln",12,"2021-12-11"]
[344,1,100,100,"Vertrieb_4","Frankfurt am Main",12,"2021-12-12"]
[345,1,200,110,"Vertrieb_1","Hamburg",12,"2021-12-13"]
[346,1,250,120,"Vertrieb_2","München",12,"2021-12-14"]
[347,1,100,100,"Vertrieb_3","Köln",12,"2021-12-15"]
[348,1,200,110,"Vertrieb_4","Frankfurt am Main",12,"2021-12-16"]
[349,1,250,120,"Vertrieb_1","Hamburg",12,"2021-12-17"]
[350,1,100,100,"Vertrieb_2","München",12,"2021-12-18"]
[351,1,200,110,"Vertrieb_3","Köln",12,"2021-12-19"]
[352,1,250,120,"Vertrieb_4","Frankfurt am Main",12,"2021-12-20"]
[353,1,100,100,"Vertrieb_1","Hamburg",12,"2021-12-21"]
[354,1,200,110,"Vertrieb_2","München",12,"2021-12-22"]
[355,1,250,120,"Vertrieb_3","Köln",12,"2021-12-23"]
[356,1,100,100,"Vertrieb_4","Frankfurt am Main",12,"2021-12-24"]
[357,1,200,110,"Vertrieb_1","Hamburg",12,"2021-12-25"]
[358,1,250,120,"Vertrieb_2","München",12,"2021-12-26"]
[359,1,100,100,"Vertrieb_3","Köln",12,"2021-12-27"]
[360,1,200,110,"Vertrieb_4","Frankfurt am Main",12,"2021-12-28"]
[361,1,250,120,"Vertrieb_1","Hamburg",12,"2021-12-29"]
[362,1,100,100,"Vertrieb_2","München",12,"2021-12-30"]
[363,1,100,100,"Vertrieb_3","Köln",12,"2021-12-31"]

{"sheet":"TE_Vertrieb","index":12,"n_rows":369,"n_cols":8,"rows_kept":369,"cut":false,"hidden":false,"merged":[]}
["lfd. Nr.","Anzahl","Umsatz","Produkt","Vertrieb","Ort","Monat","Datum"]
[1,1,100,100,"Vertrieb_1","Hamburg",1,"2021-01-03"]
[5,1,200,110,"Vertrieb_1","Hamburg",1,"2021-01-07"]
[9,1,200,110,"Vertrieb_1","Hamburg",1,"2021-01-11"]
[13,1,200,110,"Vertrieb_1","Hamburg",1,"2021-01-15"]
[17,1,250,120,"Vertrieb_1","Hamburg",1,"2021-01-19"]
[21,1,100,100,"Vertrieb_1","Hamburg",1,"2021-01-23"]
[25,1,250,120,"Vertrieb_1","Hamburg",1,"2021-01-27"]
[29,1,100,100,"Vertrieb_1","Hamburg",1,"2021-01-31"]
[33,1,200,110,"Vertrieb_1","Hamburg",2,"2021-02-04"]
[37,1,250,120,"Vertrieb_1","Hamburg",2,"2021-02-08"]
[41,1,100,100,"Vertrieb_1","Hamburg",2,"2021-02-12"]
[45,1,200,110,"Vertrieb_1","Hamburg",2,"2021-02-16"]
[49,1,250,120,"Vertrieb_1","Hamburg",2,"2021-02-20"]
[53,1,200,110,"Vertrieb_1","Hamburg",2,"2021-02-24"]
[57,1,250,120,"Vertrieb_1","Hamburg",2,"2021-02-28"]
[61,1,100,100,"Vertrieb_1","Hamburg",3,"2021-03-04"]
[65,1,200,110,"Vertrieb_1","Hamburg",3,"2021-03-08"]
[69,1,250,120,"Vertrieb_1","Hamburg",3,"2021-03-12"]
[73,1,100,100,"Vertrieb_1","Hamburg",3,"2021-03-16"]
[77,1,200,110,"Vertrieb_1","Hamburg",3,"2021-03-20"]
[81,1,250,120,"Vertrieb_1","Hamburg",3,"2021-03-24"]
[85,1,200,110,"Vertrieb_1","Hamburg",3,"2021-03-28"]
[89,1,250,120,"Vertrieb_1","Hamburg",4,"2021-04-01"]
[93,1,100,100,"Vertrieb_1","Hamburg",4,"2021-04-05"]
[97,1,200,110,"Vertrieb_1","Hamburg",4,"2021-04-09"]
[101,1,250,120,"Vertrieb_1","Hamburg",4,"2021-04-13"]
[105,1,100,100,"Vertrieb_1","Hamburg",4,"2021-04-17"]
[109,1,200,110,"Vertrieb_1","Hamburg",4,"2021-04-21"]
[113,1,250,120,"Vertrieb_1","Hamburg",4,"2021-04-25"]
[117,1,250,120,"Vertrieb_1","Hamburg",4,"2021-04-29"]
[121,1,100,100,"Vertrieb_1","Hamburg",5,"2021-05-03"]
[125,1,200,110,"Vertrieb_1","Hamburg",5,"2021-05-07"]
[129,1,250,120,"Vertrieb_1","Hamburg",5,"2021-05-11"]
[133,1,100,100,"Vertrieb_1","Hamburg",5,"2021-05-15"]
[137,1,200,110,"Vertrieb_1","Hamburg",5,"2021-05-19"]
[141,1,250,120,"Vertrieb_1","Hamburg",5,"2021-05-23"]
[145,1,100,100,"Vertrieb_1","Hamburg",5,"2021-05-27"]
[149,1,250,120,"Vertrieb_1","Hamburg",5,"2021-05-31"]
[153,1,100,100,"Vertrieb_1","Hamburg",6,"2021-06-04"]
[157,1,200,110,"Vertrieb_1","Hamburg",6,"2021-06-08"]
[161,1,250,120,"Vertrieb_1","Hamburg",6,"2021-06-12"]
[165,1,100,100,"Vertrieb_1","Hamburg",6,"2021-06-16"]
[169,1,200,110,"Vertrieb_1","Hamburg",6,"2021-06-20"]
[173,1,250,120,"Vertrieb_1","Hamburg",6,"2021-06-24"]
[177,1,200,110,"Vertrieb_1","Hamburg",6,"2021-06-28"]
[181,1,250,120,"Vertrieb_1","Hamburg",7,"2021-07-02"]
[185,1,100,100,"Vertrieb_1","Hamburg",7,"2021-07-06"]
[189,1,200,110,"Vertrieb_1","Hamburg",7,"2021-07-10"]
[193,1,250,120,"Vertrieb_1","Hamburg",7,"2021-07-14"]
[197,1,100,100,"Vertrieb_1","Hamburg",7,"2021-07-18"]
[201,1,200,110,"Vertrieb_1","Hamburg",7,"2021-07-22"]
[205,1,250,120,"Vertrieb_1","Hamburg",7,"2021-07-26"]
[209,1,200,110,"Vertrieb_1","Hamburg",7,"2021-07-30"]
[213,1,250,120,"Vertrieb_1","Hamburg",8,"2021-08-03"]
[217,1,100,100,"Vertrieb_1","Hamburg",8,"2021-08-07"]
[221,1,200,110,"Vertrieb_1","Hamburg",8,"2021-08-11"]
[225,1,250,120,"Vertrieb_1","Hamburg",8,"2021-08-15"]
[229,1,100,100,"Vertrieb_1","Hamburg",8,"2021-08-19"]
[233,1,200,110,"Vertrieb_1","Hamburg",8,"2021-08-23"]
[237,1,250,120,"Vertrieb_1","Hamburg",8,"2021-08-27"]
[241,1,250,120,"Vertrieb_1","Hamburg",8,"2021-08-31"]
[245,1,100,100,"Vertrieb_1","Hamburg",9,"2021-09-04"]
[249,1,200,110,"Vertrieb_1","Hamburg",9,"2021-09-08"]
[253,1,250,120,"Vertrieb_1","Hamburg",9,"2021-09-12"]
[257,1,100,100,"Vertrieb_1","Hamburg",9,"2021-09-16"]
[261,1,200,110,"Vertrieb_1","Hamburg",9,"2021-09-20"]
[265,1,250,120,"Vertrieb_1","Hamburg",9,"2021-09-24"]
[269,1,100,100,"Vertrieb_1","Hamburg",9,"2021-09-28"]
[273,1,250,120,"Vertrieb_1","Hamburg",10,"2021-10-02"]
[277,1,100,100,"Vertrieb_1","Hamburg",10,"2021-10-06"]
[281,1,200,110,"Vertrieb_1","Hamburg",10,"2021-10-10"]
[285,1,250,120,"Vertrieb_1","Hamburg",10,"2021-10-14"]
[289,1,100,100,"Vertrieb_1","Hamburg",10,"2021-10-18"]
[293,1,200,110,"Vertrieb_1","Hamburg",10,"2021-10-22"]
[297,1,250,120,"Vertrieb_1","Hamburg",10,"2021-10-26"]
[301,1,200,110,"Vertrieb_1","Hamburg",10,"2021-10-30"]
[305,1,250,120,"Vertrieb_1","Hamburg",11,"2021-11-03"]
[309,1,100,100,"Vertrieb_1","Hamburg",11,"2021-11-07"]
[313,1,200,110,"Vertrieb_1","Hamburg",11,"2021-11-11"]
[317,1,250,120,"Vertrieb_1","Hamburg",11,"2021-11-15"]
[321,1,100,100,"Vertrieb_1","Hamburg",11,"2021-11-19"]
[325,1,200,110,"Vertrieb_1","Hamburg",11,"2021-11-23"]
[329,1,250,120,"Vertrieb_1","Hamburg",11,"2021-11-27"]
[333,1,200,110,"Vertrieb_1","Hamburg",12,"2021-12-01"]
[337,1,250,120,"Vertrieb_1","Hamburg",12,"2021-12-05"]
[341,1,100,100,"Vertrieb_1","Hamburg",12,"2021-12-09"]
[345,1,200,110,"Vertrieb_1","Hamburg",12,"2021-12-13"]
[349,1,250,120,"Vertrieb_1","Hamburg",12,"2021-12-17"]
[353,1,100,100,"Vertrieb_1","Hamburg",12,"2021-12-21"]
[357,1,200,110,"Vertrieb_1","Hamburg",12,"2021-12-25"]
[361,1,250,120,"Vertrieb_1","Hamburg",12,"2021-12-29"]
[null,{"$f":"SUBTOTAL(9,B2:B92)","v":91},{"$f":"SUBTOTAL(9,C2:C92)","v":17300},null,"Vertrieb_1 Ergebnis"]
[2,1,200,110,"Vertrieb_2","München",1,"2021-01-04"]
[6,1,200,110,"Vertrieb_2","München",1,"2021-01-08"]
[10,1,250,120,"Vertrieb_2","München",1,"2021-01-12"]
[14,1,250,120,"Vertrieb_2","München",1,"2021-01-16"]
[18,1,100,100,"Vertrieb_2","München",1,"2021-01-20"]
[22,1,250,120,"Vertrieb_2","München",1,"2021-01-24"]
[26,1,100,100,"Vertrieb_2","München",1,"2021-01-28"]
[30,1,200,110,"Vertrieb_2","München",2,"2021-02-01"]
[34,1,250,120,"Vertrieb_2","München",2,"2021-02-05"]
[38,1,100,100,"Vertrieb_2","München",2,"2021-02-09"]
[42,1,200,110,"Vertrieb_2","München",2,"2021-02-13"]
[46,1,250,120,"Vertrieb_2","München",2,"2021-02-17"]
[50,1,100,100,"Vertrieb_2","München",2,"2021-02-21"]
[54,1,250,120,"Vertrieb_2","München",2,"2021-02-25"]
[58,1,100,100,"Vertrieb_2","München",3,"2021-03-01"]
[62,1,200,110,"Vertrieb_2","München",3,"2021-03-05"]
[66,1,250,120,"Vertrieb_2","München",3,"2021-03-09"]
[70,1,100,100,"Vertrieb_2","München",3,"2021-03-13"]
[74,1,200,110,"Vertrieb_2","München",3,"2021-03-17"]
[78,1,250,120,"Vertrieb_2","München",3,"2021-03-21"]
[82,1,100,100,"Vertrieb_2","München",3,"2021-03-25"]
[86,1,250,120,"Vertrieb_2","München",3,"2021-03-29"]
[90,1,100,100,"Vertrieb_2","München",4,"2021-04-02"]
[94,1,200,110,"Vertrieb_2","München",4,"2021-04-06"]
[98,1,250,120,"Vertrieb_2","München",4,"2021-04-10"]
[102,1,100,100,"Vertrieb_2","München",4,"2021-04-14"]
[106,1,200,110,"Vertrieb_2","München",4,"2021-04-18"]
[110,1,250,120,"Vertrieb_2","München",4,"2021-04-22"]
[114,1,100,100,"Vertrieb_2","München",4,"2021-04-26"]
[118,1,100,100,"Vertrieb_2","München",4,"2021-04-30"]
[122,1,200,110,"Vertrieb_2","München",5,"2021-05-04"]
[126,1,250,120,"Vertrieb_2","München",5,"2021-05-08"]
[130,1,100,100,"Vertrieb_2","München",5,"2021-05-12"]
[134,1,200,110,"Vertrieb_2","München",5,"2021-05-16"]
[138,1,250,120,"Vertrieb_2","München",5,"2021-05-20"]
[142,1,100,100,"Vertrieb_2","München",5,"2021-05-24"]
[146,1,250,120,"Vertrieb_2","München",5,"2021-05-28"]
[150,1,100,100,"Vertrieb_2","München",6,"2021-06-01"]
[154,1,200,110,"Vertrieb_2","München",6,"2021-06-05"]
[158,1,250,120,"Vertrieb_2","München",6,"2021-06-09"]
[162,1,100,100,"Vertrieb_2","München",6,"2021-06-13"]
[166,1,200,110,"Vertrieb_2","München",6,"2021-06-17"]
[170,1,250,120,"Vertrieb_2","München",6,"2021-06-21"]
[174,1,100,100,"Vertrieb_2","München",6,"2021-06-25"]
[178,1,250,120,"Vertrieb_2","München",6,"2021-06-29"]
[182,1,100,100,"Vertrieb_2","München",7,"2021-07-03"]
[186,1,200,110,"Vertrieb_2","München",7,"2021-07-07"]
[190,1,250,120,"Vertrieb_2","München",7,"2021-07-11"]
[194,1,100,100,"Vertrieb_2","München",7,"2021-07-15"]
[198,1,200,110,"Vertrieb_2","München",7,"2021-07-19"]
[202,1,250,120,"Vertrieb_2","München",7,"2021-07-23"]
[206,1,100,100,"Vertrieb_2","München",7,"2021-07-27"]
[210,1,250,120,"Vertrieb_2","München",7,"2021-07-31"]
[214,1,100,100,"Vertrieb_2","München",8,"2021-08-04"]
[218,1,200,110,"Vertrieb_2","München",8,"2021-08-08"]
[222,1,250,120,"Vertrieb_2","München",8,"2021-08-12"]
[226,1,100,100,"Vertrieb_2","München",8,"2021-08-16"]
[230,1,200,110,"Vertrieb_2","München",8,"2021-08-20"]
[234,1,250,120,"Vertrieb_2","München",8,"2021-08-24"]
[238,1,100,100,"Vertrieb_2","München",8,"2021-08-28"]
[242,1,100,100,"Vertrieb_2","München",9,"2021-09-01"]
[246,1,200,110,"Vertrieb_2","München",9,"2021-09-05"]
[250,1,250,120,"Vertrieb_2","München",9,"2021-09-09"]
[254,1,100,100,"Vertrieb_2","München",9,"2021-09-13"]
[258,1,200,110,"Vertrieb_2","München",9,"2021-09-17"]
[262,1,250,120,"Vertrieb_2","München",9,"2021-09-21"]
[266,1,100,100,"Vertrieb_2","München",9,"2021-09-25"]
[270,1,250,120,"Vertrieb_2","München",9,"2021-09-29"]
[274,1,100,100,"Vertrieb_2","München",10,"2021-10-03"]
[278,1,200,110,"Vertrieb_2","München",10,"2021-10-07"]
[282,1,250,120,"Vertrieb_2","München",10,"2021-10-11"]
[286,1,100,100,"Vertrieb_2","München",10,"2021-10-15"]
[290,1,200,110,"Vertrieb_2","München",10,"2021-10-19"]
[294,1,250,120,"Vertrieb_2","München",10,"2021-10-23"]
[298,1,100,100,"Vertrieb_2","München",10,"2021-10-27"]
[302,1,250,120,"Vertrieb_2","München",10,"2021-10-31"]
[306,1,100,100,"Vertrieb_2","München",11,"2021-11-04"]
[310,1,200,110,"Vertrieb_2","München",11,"2021-11-08"]
[314,1,250,120,"Vertrieb_2","München",11,"2021-11-12"]
[318,1,100,100,"Vertrieb_2","München",11,"2021-11-16"]
[322,1,200,110,"Vertrieb_2","München",11,"2021-11-20"]
[326,1,250,120,"Vertrieb_2","München",11,"2021-11-24"]
[330,1,100,100,"Vertrieb_2","München",11,"2021-11-28"]
[334,1,250,120,"Vertrieb_2","München",12,"2021-12-02"]
[338,1,100,100,"Vertrieb_2","München",12,"2021-12-06"]
[342,1,200,110,"Vertrieb_2","München",12,"2021-12-10"]
[346,1,250,120,"Vertrieb_2","München",12,"2021-12-14"]
[350,1,100,100,"Vertrieb_2","München",12,"2021-12-18"]
[354,1,200,110,"Vertrieb_2","München",12,"2021-12-22"]
[358,1,250,120,"Vertrieb_2","München",12,"2021-12-26"]
[362,1,100,100,"Vertrieb_2","München",12,"2021-12-30"]
[null,{"$f":"SUBTOTAL(9,B94:B184)","v":91},{"$f":"SUBTOTAL(9,C94:C184)","v":16450},null,"Vertrieb_2 Ergebnis"]
[3,1,250,120,"Vertrieb_3","Köln",1,"2021-01-05"]
[7,1,250,120,"Vertrieb_3","Köln",1,"2021-01-09"]
[11,1,250,120,"Vertrieb_3","Köln",1,"2021-01-13"]
[15,1,100,100,"Vertrieb_3","Köln",1,"2021-01-17"]
[19,1,200,110,"Vertrieb_3","Köln",1,"2021-01-21"]
[23,1,100,100,"Vertrieb_3","Köln",1,"2021-01-25"]
[27,1,200,110,"Vertrieb_3","Köln",1,"2021-01-29"]
[31,1,250,120,"Vertrieb_3","Köln",2,"2021-02-02"]
[35,1,100,100,"Vertrieb_3","Köln",2,"2021-02-06"]
[39,1,200,110,"Vertrieb_3","Köln",2,"2021-02-10"]
[43,1,250,120,"Vertrieb_3","Köln",2,"2021-02-14"]
[47,1,100,100,"Vertrieb_3","Köln",2,"2021-02-18"]
[51,1,200,110,"Vertrieb_3","Köln",2,"2021-02-22"]
[55,1,100,100,"Vertrieb_3","Köln",2,"2021-02-26"]
[59,1,200,110,"Vertrieb_3","Köln",3,"2021-03-02"]
[63,1,250,120,"Vertrieb_3","Köln",3,"2021-03-06"]
[67,1,100,100,"Vertrieb_3","Köln",3,"2021-03-10"]
[71,1,200,110,"Vertrieb_3","Köln",3,"2021-03-14"]
[75,1,250,120,"Vertrieb_3","Köln",3,"2021-03-18"]
[79,1,100,100,"Vertrieb_3","Köln",3,"2021-03-22"]
[83,1,200,110,"Vertrieb_3","Köln",3,"2021-03-26"]
[87,1,100,100,"Vertrieb_3","Köln",3,"2021-03-30"]
[91,1,200,110,"Vertrieb_3","Köln",4,"2021-04-03"]
[95,1,250,120,"Vertrieb_3","Köln",4,"2021-04-07"]
[99,1,100,100,"Vertrieb_3","Köln",4,"2021-04-11"]
[103,1,200,110,"Vertrieb_3","Köln",4,"2021-04-15"]
[107,1,250,120,"Vertrieb_3","Köln",4,"2021-04-19"]
[111,1,100,100,"Vertrieb_3","Köln",4,"2021-04-23"]
[115,1,100,100,"Vertrieb_3","Köln",4,"2021-04-27"]
[119,1,200,110,"Vertrieb_3","Köln",5,"2021-05-01"]
[123,1,250,120,"Vertrieb_3","Köln",5,"2021-05-05"]
[127,1,100,100,"Vertrieb_3","Köln",5,"2021-05-09"]
[131,1,200,110,"Vertrieb_3","Köln",5,"2021-05-13"]
[135,1,250,120,"Vertrieb_3","Köln",5,"2021-05-17"]
[139,1,100,100,"Vertrieb_3","Köln",5,"2021-05-21"]
[143,1,200,110,"Vertrieb_3","Köln",5,"2021-05-25"]
[147,1,100,100,"Vertrieb_3","Köln",5,"2021-05-29"]
[151,1,200,110,"Vertrieb_3","Köln",6,"2021-06-02"]
[155,1,250,120,"Vertrieb_3","Köln",6,"2021-06-06"]
[159,1,100,100,"Vertrieb_3","Köln",6,"2021-06-10"]
[163,1,200,110,"Vertrieb_3","Köln",6,"2021-06-14"]
[167,1,250,120,"Vertrieb_3","Köln",6,"2021-06-18"]
[171,1,100,100,"Vertrieb_3","Köln",6,"2021-06-22"]
[175,1,200,110,"Vertrieb_3","Köln",6,"2021-06-26"]
[179,1,100,100,"Vertrieb_3","Köln",6,"2021-06-30"]
[183,1,200,110,"Vertrieb_3","Köln",7,"2021-07-04"]
[187,1,250,120,"Vertrieb_3","Köln",7,"2021-07-08"]
[191,1,100,100,"Vertrieb_3","Köln",7,"2021-07-12"]
[195,1,200,110,"Vertrieb_3","Köln",7,"2021-07-16"]
[199,1,250,120,"Vertrieb_3","Köln",7,"2021-07-20"]
[203,1,100,100,"Vertrieb_3","Köln",7,"2021-07-24"]
[207,1,200,110,"Vertrieb_3","Köln",7,"2021-07-28"]
[211,1,100,100,"Vertrieb_3","Köln",8,"2021-08-01"]
[215,1,200,110,"Vertrieb_3","Köln",8,"2021-08-05"]
[219,1,250,120,"Vertrieb_3","Köln",8,"2021-08-09"]
[223,1,100,100,"Vertrieb_3","Köln",8,"2021-08-13"]
[227,1,200,110,"Vertrieb_3","Köln",8,"2021-08-17"]
[231,1,250,120,"Vertrieb_3","Köln",8,"2021-08-21"]
[235,1,100,100,"Vertrieb_3","Köln",8,"2021-08-25"]
[239,1,100,100,"Vertrieb_3","Köln",8,"2021-08-29"]
[243,1,200,110,"Vertrieb_3","Köln",9,"2021-09-02"]
[247,1,250,120,"Vertrieb_3","Köln",9,"2021-09-06"]
[251,1,100,100,"Vertrieb_3","Köln",9,"2021-09-10"]
[255,1,200,110,"Vertrieb_3","Köln",9,"2021-09-14"]
[259,1,250,120,"Vertrieb_3","Köln",9,"2021-09-18"]
[263,1,100,100,"Vertrieb_3","Köln",9,"2021-09-22"]
[267,1,200,110,"Vertrieb_3","Köln",9,"2021-09-26"]
[271,1,100,100,"Vertrieb_3","Köln",9,"2021-09-30"]
[275,1,200,110,"Vertrieb_3","Köln",10,"2021-10-04"]
[279,1,250,120,"Vertrieb_3","Köln",10,"2021-10-08"]
[283,1,100,100,"Vertrieb_3","Köln",10,"2021-10-12"]
[287,1,200,110,"Vertrieb_3","Köln",10,"2021-10-16"]
[291,1,250,120,"Vertrieb_3","Köln",10,"2021-10-20"]
[295,1,100,100,"Vertrieb_3","Köln",10,"2021-10-24"]
[299,1,200,110,"Vertrieb_3","Köln",10,"2021-10-28"]
[303,1,100,100,"Vertrieb_3","Köln",11,"2021-11-01"]
[307,1,200,110,"Vertrieb_3","Köln",11,"2021-11-05"]
[311,1,250,120,"Vertrieb_3","Köln",11,"2021-11-09"]
[315,1,100,100,"Vertrieb_3","Köln",11,"2021-11-13"]
[319,1,200,110,"Vertrieb_3","Köln",11,"2021-11-17"]
[323,1,250,120,"Vertrieb_3","Köln",11,"2021-11-21"]
[327,1,100,100,"Vertrieb_3","Köln",11,"2021-11-25"]
[331,1,200,110,"Vertrieb_3","Köln",11,"2021-11-29"]
[335,1,100,100,"Vertrieb_3","Köln",12,"2021-12-03"]
[339,1,200,110,"Vertrieb_3","Köln",12,"2021-12-07"]
[343,1,250,120,"Vertrieb_3","Köln",12,"2021-12-11"]
[347,1,100,100,"Vertrieb_3","Köln",12,"2021-12-15"]
[351,1,200,110,"Vertrieb_3","Köln",12,"2021-12-19"]
[355,1,250,120,"Vertrieb_3","Köln",12,"2021-12-23"]
[359,1,100,100,"Vertrieb_3","Köln",12,"2021-12-27"]
[363,1,100,100,"Vertrieb_3","Köln",12,"2021-12-31"]
[null,{"$f":"SUBTOTAL(9,B186:B276)","v":91},{"$f":"SUBTOTAL(9,C186:C276)","v":15950},null,"Vertrieb_3 Ergebnis"]
[4,1,100,100,"Vertrieb_4","Frankfurt am Main",1,"2021-01-06"]
[8,1,100,100,"Vertrieb_4","Frankfurt am Main",1,"2021-01-10"]
[12,1,100,100,"Vertrieb_4","Frankfurt am Main",1,"2021-01-14"]
[16,1,200,110,"Vertrieb_4","Frankfurt am Main",1,"2021-01-18"]
[20,1,250,120,"Vertrieb_4","Frankfurt am Main",1,"2021-01-22"]
[24,1,200,110,"Vertrieb_4","Frankfurt am Main",1,"2021-01-26"]
[28,1,250,120,"Vertrieb_4","Frankfurt am Main",1,"2021-01-30"]
[32,1,100,100,"Vertrieb_4","Frankfurt am Main",2,"2021-02-03"]
[36,1,200,110,"Vertrieb_4","Frankfurt am Main",2,"2021-02-07"]
[40,1,250,120,"Vertrieb_4","Frankfurt am Main",2,"2021-02-11"]
[44,1,100,100,"Vertrieb_4","Frankfurt am Main",2,"2021-02-15"]
[48,1,200,110,"Vertrieb_4","Frankfurt am Main",2,"2021-02-19"]
[52,1,250,120,"Vertrieb_4","Frankfurt am Main",2,"2021-02-23"]
[56,1,200,110,"Vertrieb_4","Frankfurt am Main",2,"2021-02-27"]
[60,1,250,120,"Vertrieb_4","Frankfurt am Main",3,"2021-03-03"]
[64,1,100,100,"Vertrieb_4","Frankfurt am Main",3,"2021-03-07"]
[68,1,200,110,"Vertrieb_4","Frankfurt am Main",3,"2021-03-11"]
[72,1,250,120,"Vertrieb_4","Frankfurt am Main",3,"2021-03-15"]
[76,1,100,100,"Vertrieb_4","Frankfurt am Main",3,"2021-03-19"]
[80,1,200,110,"Vertrieb_4","Frankfurt am Main",3,"2021-03-23"]
[84,1,100,100,"Vertrieb_4","Frankfurt am Main",3,"2021-03-27"]
[88,1,200,110,"Vertrieb_4","Frankfurt am Main",3,"2021-03-31"]
[92,1,250,120,"Vertrieb_4","Frankfurt am Main",4,"2021-04-04"]
[96,1,100,100,"Vertrieb_4","Frankfurt am Main",4,"2021-04-08"]
[100,1,200,110,"Vertrieb_4","Frankfurt am Main",4,"2021-04-12"]
[104,1,250,120,"Vertrieb_4","Frankfurt am Main",4,"2021-04-16"]
[108,1,100,100,"Vertrieb_4","Frankfurt am Main",4,"2021-04-20"]
[112,1,200,110,"Vertrieb_4","Frankfurt am Main",4,"2021-04-24"]
[116,1,200,110,"Vertrieb_4","Frankfurt am Main",4,"2021-04-28"]
[120,1,250,120,"Vertrieb_4","Frankfurt am Main",5,"2021-05-02"]
[124,1,100,100,"Vertrieb_4","Frankfurt am Main",5,"2021-05-06"]
[128,1,200,110,"Vertrieb_4","Frankfurt am Main",5,"2021-05-10"]
[132,1,250,120,"Vertrieb_4","Frankfurt am Main",5,"2021-05-14"]
[136,1,100,100,"Vertrieb_4","Frankfurt am Main",5,"2021-05-18"]
[140,1,200,110,"Vertrieb_4","Frankfurt am Main",5,"2021-05-22"]
[144,1,250,120,"Vertrieb_4","Frankfurt am Main",5,"2021-05-26"]
[148,1,200,110,"Vertrieb_4","Frankfurt am Main",5,"2021-05-30"]
[152,1,250,120,"Vertrieb_4","Frankfurt am Main",6,"2021-06-03"]
[156,1,100,100,"Vertrieb_4","Frankfurt am Main",6,"2021-06-07"]
[160,1,200,110,"Vertrieb_4","Frankfurt am Main",6,"2021-06-11"]
[164,1,250,120,"Vertrieb_4","Frankfurt am Main",6,"2021-06-15"]
[168,1,100,100,"Vertrieb_4","Frankfurt am Main",6,"2021-06-19"]
[172,1,200,110,"Vertrieb_4","Frankfurt am Main",6,"2021-06-23"]
[176,1,250,120,"Vertrieb_4","Frankfurt am Main",6,"2021-06-27"]
[180,1,200,110,"Vertrieb_4","Frankfurt am Main",7,"2021-07-01"]
[184,1,250,120,"Vertrieb_4","Frankfurt am Main",7,"2021-07-05"]
[188,1,100,100,"Vertrieb_4","Frankfurt am Main",7,"2021-07-09"]
[192,1,200,110,"Vertrieb_4","Frankfurt am Main",7,"2021-07-13"]
[196,1,250,120,"Vertrieb_4","Frankfurt am Main",7,"2021-07-17"]
[200,1,100,100,"Vertrieb_4","Frankfurt am Main",7,"2021-07-21"]
[204,1,200,110,"Vertrieb_4","Frankfurt am Main",7,"2021-07-25"]
[208,1,100,100,"Vertrieb_4","Frankfurt am Main",7,"2021-07-29"]
[212,1,200,110,"Vertrieb_4","Frankfurt am Main",8,"2021-08-02"]
[216,1,250,120,"Vertrieb_4","Frankfurt am Main",8,"2021-08-06"]
[220,1,100,100,"Vertrieb_4","Frankfurt am Main",8,"2021-08-10"]
[224,1,200,110,"Vertrieb_4","Frankfurt am Main",8,"2021-08-14"]
[228,1,250,120,"Vertrieb_4","Frankfurt am Main",8,"2021-08-18"]
[232,1,100,100,"Vertrieb_4","Frankfurt am Main",8,"2021-08-22"]
[236,1,200,110,"Vertrieb_4","Frankfurt am Main",8,"2021-08-26"]
[240,1,200,110,"Vertrieb_4","Frankfurt am Main",8,"2021-08-30"]
[244,1,250,120,"Vertrieb_4","Frankfurt am Main",9,"2021-09-03"]
[248,1,100,100,"Vertrieb_4","Frankfurt am Main",9,"2021-09-07"]
[252,1,200,110,"Vertrieb_4","Frankfurt am Main",9,"2021-09-11"]
[256,1,250,120,"Vertrieb_4","Frankfurt am Main",9,"2021-09-15"]
[260,1,100,100,"Vertrieb_4","Frankfurt am Main",9,"2021-09-19"]
[264,1,200,110,"Vertrieb_4","Frankfurt am Main",9,"2021-09-23"]
[268,1,250,120,"Vertrieb_4","Frankfurt am Main",9,"2021-09-27"]
[272,1,200,110,"Vertrieb_4","Frankfurt am Main",10,"2021-10-01"]
[276,1,250,120,"Vertrieb_4","Frankfurt am Main",10,"2021-10-05"]
[280,1,100,100,"Vertrieb_4","Frankfurt am Main",10,"2021-10-09"]
[284,1,200,110,"Vertrieb_4","Frankfurt am Main",10,"2021-10-13"]
[288,1,250,120,"Vertrieb_4","Frankfurt am Main",10,"2021-10-17"]
[292,1,100,100,"Vertrieb_4","Frankfurt am Main",10,"2021-10-21"]
[296,1,200,110,"Vertrieb_4","Frankfurt am Main",10,"2021-10-25"]
[300,1,250,120,"Vertrieb_4","Frankfurt am Main",10,"2021-10-29"]
[304,1,200,110,"Vertrieb_4","Frankfurt am Main",11,"2021-11-02"]
[308,1,250,120,"Vertrieb_4","Frankfurt am Main",11,"2021-11-06"]
[312,1,100,100,"Vertrieb_4","Frankfurt am Main",11,"2021-11-10"]
[316,1,200,110,"Vertrieb_4","Frankfurt am Main",11,"2021-11-14"]
[320,1,250,120,"Vertrieb_4","Frankfurt am Main",11,"2021-11-18"]
[324,1,100,100,"Vertrieb_4","Frankfurt am Main",11,"2021-11-22"]
[328,1,200,110,"Vertrieb_4","Frankfurt am Main",11,"2021-11-26"]
[332,1,100,100,"Vertrieb_4","Frankfurt am Main",11,"2021-11-30"]
[336,1,200,110,"Vertrieb_4","Frankfurt am Main",12,"2021-12-04"]
[340,1,250,120,"Vertrieb_4","Frankfurt am Main",12,"2021-12-08"]
[344,1,100,100,"Vertrieb_4","Frankfurt am Main",12,"2021-12-12"]
[348,1,200,110,"Vertrieb_4","Frankfurt am Main",12,"2021-12-16"]
[352,1,250,120,"Vertrieb_4","Frankfurt am Main",12,"2021-12-20"]
[356,1,100,100,"Vertrieb_4","Frankfurt am Main",12,"2021-12-24"]
[360,1,200,110,"Vertrieb_4","Frankfurt am Main",12,"2021-12-28"]
[null,{"$f":"SUBTOTAL(9,B278:B367)","v":90},{"$f":"SUBTOTAL(9,C278:C367)","v":16600},null,"Vertrieb_4 Ergebnis"]
[null,{"$f":"SUBTOTAL(9,B2:B367)","v":363},{"$f":"SUBTOTAL(9,C2:C367)","v":66300},null,"Gesamtergebnis"]

{"sheet":"TE_Produkt","index":13,"n_rows":368,"n_cols":8,"rows_kept":368,"cut":false,"hidden":false,"merged":[]}
["lfd. Nr.","Anzahl","Umsatz","Produkt","Vertrieb","Ort","Monat","Datum"]
[1,1,100,100,"Vertrieb_1","Hamburg",1,"2021-01-03"]
[4,1,100,100,"Vertrieb_4","Frankfurt am Main",1,"2021-01-06"]
[8,1,100,100,"Vertrieb_4","Frankfurt am Main",1,"2021-01-10"]
[12,1,100,100,"Vertrieb_4","Frankfurt am Main",1,"2021-01-14"]
[15,1,100,100,"Vertrieb_3","Köln",1,"2021-01-17"]
[18,1,100,100,"Vertrieb_2","München",1,"2021-01-20"]
[21,1,100,100,"Vertrieb_1","Hamburg",1,"2021-01-23"]
[23,1,100,100,"Vertrieb_3","Köln",1,"2021-01-25"]
[26,1,100,100,"Vertrieb_2","München",1,"2021-01-28"]
[29,1,100,100,"Vertrieb_1","Hamburg",1,"2021-01-31"]
[32,1,100,100,"Vertrieb_4","Frankfurt am Main",2,"2021-02-03"]
[35,1,100,100,"Vertrieb_3","Köln",2,"2021-02-06"]
[38,1,100,100,"Vertrieb_2","München",2,"2021-02-09"]
[41,1,100,100,"Vertrieb_1","Hamburg",2,"2021-02-12"]
[44,1,100,100,"Vertrieb_4","Frankfurt am Main",2,"2021-02-15"]
[47,1,100,100,"Vertrieb_3","Köln",2,"2021-02-18"]
[50,1,100,100,"Vertrieb_2","München",2,"2021-02-21"]
[55,1,100,100,"Vertrieb_3","Köln",2,"2021-02-26"]
[58,1,100,100,"Vertrieb_2","München",3,"2021-03-01"]
[61,1,100,100,"Vertrieb_1","Hamburg",3,"2021-03-04"]
[64,1,100,100,"Vertrieb_4","Frankfurt am Main",3,"2021-03-07"]
[67,1,100,100,"Vertrieb_3","Köln",3,"2021-03-10"]
[70,1,100,100,"Vertrieb_2","München",3,"2021-03-13"]
[73,1,100,100,"Vertrieb_1","Hamburg",3,"2021-03-16"]
[76,1,100,100,"Vertrieb_4","Frankfurt am Main",3,"2021-03-19"]
[79,1,100,100,"Vertrieb_3","Köln",3,"2021-03-22"]
[82,1,100,100,"Vertrieb_2","München",3,"2021-03-25"]
[84,1,100,100,"Vertrieb_4","Frankfurt am Main",3,"2021-03-27"]
[87,1,100,100,"Vertrieb_3","Köln",3,"2021-03-30"]
[90,1,100,100,"Vertrieb_2","München",4,"2021-04-02"]
[93,1,100,100,"Vertrieb_1","Hamburg",4,"2021-04-05"]
[96,1,100,100,"Vertrieb_4","Frankfurt am Main",4,"2021-04-08"]
[99,1,100,100,"Vertrieb_3","Köln",4,"2021-04-11"]
[102,1,100,100,"Vertrieb_2","München",4,"2021-04-14"]
[105,1,100,100,"Vertrieb_1","Hamburg",4,"2021-04-17"]
[108,1,100,100,"Vertrieb_4","Frankfurt am Main",4,"2021-04-20"]
[111,1,100,100,"Vertrieb_3","Köln",4,"2021-04-23"]
[114,1,100,100,"Vertrieb_2","München",4,"2021-04-26"]
[115,1,100,100,"Vertrieb_3","Köln",4,"2021-04-27"]
[118,1,100,100,"Vertrieb_2","München",4,"2021-04-30"]
[121,1,100,100,"Vertrieb_1","Hamburg",5,"2021-05-03"]
[124,1,100,100,"Vertrieb_4","Frankfurt am Main",5,"2021-05-06"]
[127,1,100,100,"Vertrieb_3","Köln",5,"2021-05-09"]
[130,1,100,100,"Vertrieb_2","München",5,"2021-05-12"]
[133,1,100,100,"Vertrieb_1","Hamburg",5,"2021-05-15"]
[136,1,100,100,"Vertrieb_4","Frankfurt am Main",5,"2021-05-18"]
[139,1,100,100,"Vertrieb_3","Köln",5,"2021-05-21"]
[142,1,100,100,"Vertrieb_2","München",5,"2021-05-24"]
[145,1,100,100,"Vertrieb_1","Hamburg",5,"2021-05-27"]
[147,1,100,100,"Vertrieb_3","Köln",5,"2021-05-29"]
[150,1,100,100,"Vertrieb_2","München",6,"2021-06-01"]
[153,1,100,100,"Vertrieb_1","Hamburg",6,"2021-06-04"]
[156,1,100,100,"Vertrieb_4","Frankfurt am Main",6,"2021-06-07"]
[159,1,100,100,"Vertrieb_3","Köln",6,"2021-06-10"]
[162,1,100,100,"Vertrieb_2","München",6,"2021-06-13"]
[165,1,100,100,"Vertrieb_1","Hamburg",6,"2021-06-16"]
[168,1,100,100,"Vertrieb_4","Frankfurt am Main",6,"2021-06-19"]
[171,1,100,100,"Vertrieb_3","Köln",6,"2021-06-22"]
[174,1,100,100,"Vertrieb_2","München",6,"2021-06-25"]
[179,1,100,100,"Vertrieb_3","Köln",6,"2021-06-30"]
[182,1,100,100,"Vertrieb_2","München",7,"2021-07-03"]
[185,1,100,100,"Vertrieb_1","Hamburg",7,"2021-07-06"]
[188,1,100,100,"Vertrieb_4","Frankfurt am Main",7,"2021-07-09"]
[191,1,100,100,"Vertrieb_3","Köln",7,"2021-07-12"]
[194,1,100,100,"Vertrieb_2","München",7,"2021-07-15"]
[197,1,100,100,"Vertrieb_1","Hamburg",7,"2021-07-18"]
[200,1,100,100,"Vertrieb_4","Frankfurt am Main",7,"2021-07-21"]
[203,1,100,100,"Vertrieb_3","Köln",7,"2021-07-24"]
[206,1,100,100,"Vertrieb_2","München",7,"2021-07-27"]
[208,1,100,100,"Vertrieb_4","Frankfurt am Main",7,"2021-07-29"]
[211,1,100,100,"Vertrieb_3","Köln",8,"2021-08-01"]
[214,1,100,100,"Vertrieb_2","München",8,"2021-08-04"]
[217,1,100,100,"Vertrieb_1","Hamburg",8,"2021-08-07"]
[220,1,100,100,"Vertrieb_4","Frankfurt am Main",8,"2021-08-10"]
[223,1,100,100,"Vertrieb_3","Köln",8,"2021-08-13"]
[226,1,100,100,"Vertrieb_2","München",8,"2021-08-16"]
[229,1,100,100,"Vertrieb_1","Hamburg",8,"2021-08-19"]
[232,1,100,100,"Vertrieb_4","Frankfurt am Main",8,"2021-08-22"]
[235,1,100,100,"Vertrieb_3","Köln",8,"2021-08-25"]
[238,1,100,100,"Vertrieb_2","München",8,"2021-08-28"]
[239,1,100,100,"Vertrieb_3","Köln",8,"2021-08-29"]
[242,1,100,100,"Vertrieb_2","München",9,"2021-09-01"]
[245,1,100,100,"Vertrieb_1","Hamburg",9,"2021-09-04"]
[248,1,100,100,"Vertrieb_4","Frankfurt am Main",9,"2021-09-07"]
[251,1,100,100,"Vertrieb_3","Köln",9,"2021-09-10"]
[254,1,100,100,"Vertrieb_2","München",9,"2021-09-13"]
[257,1,100,100,"Vertrieb_1","Hamburg",9,"2021-09-16"]
[260,1,100,100,"Vertrieb_4","Frankfurt am Main",9,"2021-09-19"]
[263,1,100,100,"Vertrieb_3","Köln",9,"2021-09-22"]
[266,1,100,100,"Vertrieb_2","München",9,"2021-09-25"]
[269,1,100,100,"Vertrieb_1","Hamburg",9,"2021-09-28"]
[271,1,100,100,"Vertrieb_3","Köln",9,"2021-09-30"]
[274,1,100,100,"Vertrieb_2","München",10,"2021-10-03"]
[277,1,100,100,"Vertrieb_1","Hamburg",10,"2021-10-06"]
[280,1,100,100,"Vertrieb_4","Frankfurt am Main",10,"2021-10-09"]
[283,1,100,100,"Vertrieb_3","Köln",10,"2021-10-12"]
[286,1,100,100,"Vertrieb_2","München",10,"2021-10-15"]
[289,1,100,100,"Vertrieb_1","Hamburg",10,"2021-10-18"]
[292,1,100,100,"Vertrieb_4","Frankfurt am Main",10,"2021-10-21"]
[295,1,100,100,"Vertrieb_3","Köln",10,"2021-10-24"]
[298,1,100,100,"Vertrieb_2","München",10,"2021-10-27"]
[303,1,100,100,"Vertrieb_3","Köln",11,"2021-11-01"]
[306,1,100,100,"Vertrieb_2","München",11,"2021-11-04"]
[309,1,100,100,"Vertrieb_1","Hamburg",11,"2021-11-07"]
[312,1,100,100,"Vertrieb_4","Frankfurt am Main",11,"2021-11-10"]
[315,1,100,100,"Vertrieb_3","Köln",11,"2021-11-13"]
[318,1,100,100,"Vertrieb_2","München",11,"2021-11-16"]
[321,1,100,100,"Vertrieb_1","Hamburg",11,"2021-11-19"]
[324,1,100,100,"Vertrieb_4","Frankfurt am Main",11,"2021-11-22"]
[327,1,100,100,"Vertrieb_3","Köln",11,"2021-11-25"]
[330,1,100,100,"Vertrieb_2","München",11,"2021-11-28"]
[332,1,100,100,"Vertrieb_4","Frankfurt am Main",11,"2021-11-30"]
[335,1,100,100,"Vertrieb_3","Köln",12,"2021-12-03"]
[338,1,100,100,"Vertrieb_2","München",12,"2021-12-06"]
[341,1,100,100,"Vertrieb_1","Hamburg",12,"2021-12-09"]
[344,1,100,100,"Vertrieb_4","Frankfurt am Main",12,"2021-12-12"]
[347,1,100,100,"Vertrieb_3","Köln",12,"2021-12-15"]
[350,1,100,100,"Vertrieb_2","München",12,"2021-12-18"]
[353,1,100,100,"Vertrieb_1","Hamburg",12,"2021-12-21"]
[356,1,100,100,"Vertrieb_4","Frankfurt am Main",12,"2021-12-24"]
[359,1,100,100,"Vertrieb_3","Köln",12,"2021-12-27"]
[362,1,100,100,"Vertrieb_2","München",12,"2021-12-30"]
[363,1,100,100,"Vertrieb_3","Köln",12,"2021-12-31"]
[null,{"$f":"SUBTOTAL(9,B2:B124)","v":123},{"$f":"SUBTOTAL(9,C2:C124)","v":12300},"100 Ergebnis"]
[2,1,200,110,"Vertrieb_2","München",1,"2021-01-04"]
[5,1,200,110,"Vertrieb_1","Hamburg",1,"2021-01-07"]
[6,1,200,110,"Vertrieb_2","München",1,"2021-01-08"]
[9,1,200,110,"Vertrieb_1","Hamburg",1,"2021-01-11"]
[13,1,200,110,"Vertrieb_1","Hamburg",1,"2021-01-15"]
[16,1,200,110,"Vertrieb_4","Frankfurt am Main",1,"2021-01-18"]
[19,1,200,110,"Vertrieb_3","Köln",1,"2021-01-21"]
[24,1,200,110,"Vertrieb_4","Frankfurt am Main",1,"2021-01-26"]
[27,1,200,110,"Vertrieb_3","Köln",1,"2021-01-29"]
[30,1,200,110,"Vertrieb_2","München",2,"2021-02-01"]
[33,1,200,110,"Vertrieb_1","Hamburg",2,"2021-02-04"]
[36,1,200,110,"Vertrieb_4","Frankfurt am Main",2,"2021-02-07"]
[39,1,200,110,"Vertrieb_3","Köln",2,"2021-02-10"]
[42,1,200,110,"Vertrieb_2","München",2,"2021-02-13"]
[45,1,200,110,"Vertrieb_1","Hamburg",2,"2021-02-16"]
[48,1,200,110,"Vertrieb_4","Frankfurt am Main",2,"2021-02-19"]
[51,1,200,110,"Vertrieb_3","Köln",2,"2021-02-22"]
[53,1,200,110,"Vertrieb_1","Hamburg",2,"2021-02-24"]
[56,1,200,110,"Vertrieb_4","Frankfurt am Main",2,"2021-02-27"]
[59,1,200,110,"Vertrieb_3","Köln",3,"2021-03-02"]
[62,1,200,110,"Vertrieb_2","München",3,"2021-03-05"]
[65,1,200,110,"Vertrieb_1","Hamburg",3,"2021-03-08"]
[68,1,200,110,"Vertrieb_4","Frankfurt am Main",3,"2021-03-11"]
[71,1,200,110,"Vertrieb_3","Köln",3,"2021-03-14"]
[74,1,200,110,"Vertrieb_2","München",3,"2021-03-17"]
[77,1,200,110,"Vertrieb_1","Hamburg",3,"2021-03-20"]
[80,1,200,110,"Vertrieb_4","Frankfurt am Main",3,"2021-03-23"]
[83,1,200,110,"Vertrieb_3","Köln",3,"2021-03-26"]
[85,1,200,110,"Vertrieb_1","Hamburg",3,"2021-03-28"]
[88,1,200,110,"Vertrieb_4","Frankfurt am Main",3,"2021-03-31"]
[91,1,200,110,"Vertrieb_3","Köln",4,"2021-04-03"]
[94,1,200,110,"Vertrieb_2","München",4,"2021-04-06"]
[97,1,200,110,"Vertrieb_1","Hamburg",4,"2021-04-09"]
[100,1,200,110,"Vertrieb_4","Frankfurt am Main",4,"2021-04-12"]
[103,1,200,110,"Vertrieb_3","Köln",4,"2021-04-15"]
[106,1,200,110,"Vertrieb_2","München",4,"2021-04-18"]
[109,1,200,110,"Vertrieb_1","Hamburg",4,"2021-04-21"]
[112,1,200,110,"Vertrieb_4","Frankfurt am Main",4,"2021-04-24"]
[116,1,200,110,"Vertrieb_4","Frankfurt am Main",4,"2021-04-28"]
[119,1,200,110,"Vertrieb_3","Köln",5,"2021-05-01"]
[122,1,200,110,"Vertrieb_2","München",5,"2021-05-04"]
[125,1,200,110,"Vertrieb_1","Hamburg",5,"2021-05-07"]
[128,1,200,110,"Vertrieb_4","Frankfurt am Main",5,"2021-05-10"]
[131,1,200,110,"Vertrieb_3","Köln",5,"2021-05-13"]
[134,1,200,110,"Vertrieb_2","München",5,"2021-05-16"]
[137,1,200,110,"Vertrieb_1","Hamburg",5,"2021-05-19"]
[140,1,200,110,"Vertrieb_4","Frankfurt am Main",5,"2021-05-22"]
[143,1,200,110,"Vertrieb_3","Köln",5,"2021-05-25"]
[148,1,200,110,"Vertrieb_4","Frankfurt am Main",5,"2021-05-30"]
[151,1,200,110,"Vertrieb_3","Köln",6,"2021-06-02"]
[154,1,200,110,"Vertrieb_2","München",6,"2021-06-05"]
[157,1,200,110,"Vertrieb_1","Hamburg",6,"2021-06-08"]
[160,1,200,110,"Vertrieb_4","Frankfurt am Main",6,"2021-06-11"]
[163,1,200,110,"Vertrieb_3","Köln",6,"2021-06-14"]
[166,1,200,110,"Vertrieb_2","München",6,"2021-06-17"]
[169,1,200,110,"Vertrieb_1","Hamburg",6,"2021-06-20"]
[172,1,200,110,"Vertrieb_4","Frankfurt am Main",6,"2021-06-23"]
[175,1,200,110,"Vertrieb_3","Köln",6,"2021-06-26"]
[177,1,200,110,"Vertrieb_1","Hamburg",6,"2021-06-28"]
[180,1,200,110,"Vertrieb_4","Frankfurt am Main",7,"2021-07-01"]
[183,1,200,110,"Vertrieb_3","Köln",7,"2021-07-04"]
[186,1,200,110,"Vertrieb_2","München",7,"2021-07-07"]
[189,1,200,110,"Vertrieb_1","Hamburg",7,"2021-07-10"]
[192,1,200,110,"Vertrieb_4","Frankfurt am Main",7,"2021-07-13"]
[195,1,200,110,"Vertrieb_3","Köln",7,"2021-07-16"]
[198,1,200,110,"Vertrieb_2","München",7,"2021-07-19"]
[201,1,200,110,"Vertrieb_1","Hamburg",7,"2021-07-22"]
[204,1,200,110,"Vertrieb_4","Frankfurt am Main",7,"2021-07-25"]
[207,1,200,110,"Vertrieb_3","Köln",7,"2021-07-28"]
[209,1,200,110,"Vertrieb_1","Hamburg",7,"2021-07-30"]
[212,1,200,110,"Vertrieb_4","Frankfurt am Main",8,"2021-08-02"]
[215,1,200,110,"Vertrieb_3","Köln",8,"2021-08-05"]
[218,1,200,110,"Vertrieb_2","München",8,"2021-08-08"]
[221,1,200,110,"Vertrieb_1","Hamburg",8,"2021-08-11"]
[224,1,200,110,"Vertrieb_4","Frankfurt am Main",8,"2021-08-14"]
[227,1,200,110,"Vertrieb_3","Köln",8,"2021-08-17"]
[230,1,200,110,"Vertrieb_2","München",8,"2021-08-20"]
[233,1,200,110,"Vertrieb_1","Hamburg",8,"2021-08-23"]
[236,1,200,110,"Vertrieb_4","Frankfurt am Main",8,"2021-08-26"]
[240,1,200,110,"Vertrieb_4","Frankfurt am Main",8,"2021-08-30"]
[243,1,200,110,"Vertrieb_3","Köln",9,"2021-09-02"]
[246,1,200,110,"Vertrieb_2","München",9,"2021-09-05"]
[249,1,200,110,"Vertrieb_1","Hamburg",9,"2021-09-08"]
[252,1,200,110,"Vertrieb_4","Frankfurt am Main",9,"2021-09-11"]
[255,1,200,110,"Vertrieb_3","Köln",9,"2021-09-14"]
[258,1,200,110,"Vertrieb_2","München",9,"2021-09-17"]
[261,1,200,110,"Vertrieb_1","Hamburg",9,"2021-09-20"]
[264,1,200,110,"Vertrieb_4","Frankfurt am Main",9,"2021-09-23"]
[267,1,200,110,"Vertrieb_3","Köln",9,"2021-09-26"]
[272,1,200,110,"Vertrieb_4","Frankfurt am Main",10,"2021-10-01"]
[275,1,200,110,"Vertrieb_3","Köln",10,"2021-10-04"]
[278,1,200,110,"Vertrieb_2","München",10,"2021-10-07"]
[281,1,200,110,"Vertrieb_1","Hamburg",10,"2021-10-10"]
[284,1,200,110,"Vertrieb_4","Frankfurt am Main",10,"2021-10-13"]
[287,1,200,110,"Vertrieb_3","Köln",10,"2021-10-16"]
[290,1,200,110,"Vertrieb_2","München",10,"2021-10-19"]
[293,1,200,110,"Vertrieb_1","Hamburg",10,"2021-10-22"]
[296,1,200,110,"Vertrieb_4","Frankfurt am Main",10,"2021-10-25"]
[299,1,200,110,"Vertrieb_3","Köln",10,"2021-10-28"]
[301,1,200,110,"Vertrieb_1","Hamburg",10,"2021-10-30"]
[304,1,200,110,"Vertrieb_4","Frankfurt am Main",11,"2021-11-02"]
[307,1,200,110,"Vertrieb_3","Köln",11,"2021-11-05"]
[310,1,200,110,"Vertrieb_2","München",11,"2021-11-08"]
[313,1,200,110,"Vertrieb_1","Hamburg",11,"2021-11-11"]
[316,1,200,110,"Vertrieb_4","Frankfurt am Main",11,"2021-11-14"]
[319,1,200,110,"Vertrieb_3","Köln",11,"2021-11-17"]
[322,1,200,110,"Vertrieb_2","München",11,"2021-11-20"]
[325,1,200,110,"Vertrieb_1","Hamburg",11,"2021-11-23"]
[328,1,200,110,"Vertrieb_4","Frankfurt am Main",11,"2021-11-26"]
[331,1,200,110,"Vertrieb_3","Köln",11,"2021-11-29"]
[333,1,200,110,"Vertrieb_1","Hamburg",12,"2021-12-01"]
[336,1,200,110,"Vertrieb_4","Frankfurt am Main",12,"2021-12-04"]
[339,1,200,110,"Vertrieb_3","Köln",12,"2021-12-07"]
[342,1,200,110,"Vertrieb_2","München",12,"2021-12-10"]
[345,1,200,110,"Vertrieb_1","Hamburg",12,"2021-12-13"]
[348,1,200,110,"Vertrieb_4","Frankfurt am Main",12,"2021-12-16"]
[351,1,200,110,"Vertrieb_3","Köln",12,"2021-12-19"]
[354,1,200,110,"Vertrieb_2","München",12,"2021-12-22"]
[357,1,200,110,"Vertrieb_1","Hamburg",12,"2021-12-25"]
[360,1,200,110,"Vertrieb_4","Frankfurt am Main",12,"2021-12-28"]
[null,{"$f":"SUBTOTAL(9,B126:B245)","v":120},{"$f":"SUBTOTAL(9,C126:C245)","v":24000},"110 Ergebnis"]
[3,1,250,120,"Vertrieb_3","Köln",1,"2021-01-05"]
[7,1,250,120,"Vertrieb_3","Köln",1,"2021-01-09"]
[10,1,250,120,"Vertrieb_2","München",1,"2021-01-12"]
[11,1,250,120,"Vertrieb_3","Köln",1,"2021-01-13"]
[14,1,250,120,"Vertrieb_2","München",1,"2021-01-16"]
[17,1,250,120,"Vertrieb_1","Hamburg",1,"2021-01-19"]
[20,1,250,120,"Vertrieb_4","Frankfurt am Main",1,"2021-01-22"]
[22,1,250,120,"Vertrieb_2","München",1,"2021-01-24"]
[25,1,250,120,"Vertrieb_1","Hamburg",1,"2021-01-27"]
[28,1,250,120,"Vertrieb_4","Frankfurt am Main",1,"2021-01-30"]
[31,1,250,120,"Vertrieb_3","Köln",2,"2021-02-02"]
[34,1,250,120,"Vertrieb_2","München",2,"2021-02-05"]
[37,1,250,120,"Vertrieb_1","Hamburg",2,"2021-02-08"]
[40,1,250,120,"Vertrieb_4","Frankfurt am Main",2,"2021-02-11"]
[43,1,250,120,"Vertrieb_3","Köln",2,"2021-02-14"]
[46,1,250,120,"Vertrieb_2","München",2,"2021-02-17"]
[49,1,250,120,"Vertrieb_1","Hamburg",2,"2021-02-20"]
[52,1,250,120,"Vertrieb_4","Frankfurt am Main",2,"2021-02-23"]
[54,1,250,120,"Vertrieb_2","München",2,"2021-02-25"]
[57,1,250,120,"Vertrieb_1","Hamburg",2,"2021-02-28"]
[60,1,250,120,"Vertrieb_4","Frankfurt am Main",3,"2021-03-03"]
[63,1,250,120,"Vertrieb_3","Köln",3,"2021-03-06"]
[66,1,250,120,"Vertrieb_2","München",3,"2021-03-09"]
[69,1,250,120,"Vertrieb_1","Hamburg",3,"2021-03-12"]
[72,1,250,120,"Vertrieb_4","Frankfurt am Main",3,"2021-03-15"]
[75,1,250,120,"Vertrieb_3","Köln",3,"2021-03-18"]
[78,1,250,120,"Vertrieb_2","München",3,"2021-03-21"]
[81,1,250,120,"Vertrieb_1","Hamburg",3,"2021-03-24"]
[86,1,250,120,"Vertrieb_2","München",3,"2021-03-29"]
[89,1,250,120,"Vertrieb_1","Hamburg",4,"2021-04-01"]
[92,1,250,120,"Vertrieb_4","Frankfurt am Main",4,"2021-04-04"]
[95,1,250,120,"Vertrieb_3","Köln",4,"2021-04-07"]
[98,1,250,120,"Vertrieb_2","München",4,"2021-04-10"]
[101,1,250,120,"Vertrieb_1","Hamburg",4,"2021-04-13"]
[104,1,250,120,"Vertrieb_4","Frankfurt am Main",4,"2021-04-16"]
[107,1,250,120,"Vertrieb_3","Köln",4,"2021-04-19"]
[110,1,250,120,"Vertrieb_2","München",4,"2021-04-22"]
[113,1,250,120,"Vertrieb_1","Hamburg",4,"2021-04-25"]
[117,1,250,120,"Vertrieb_1","Hamburg",4,"2021-04-29"]
[120,1,250,120,"Vertrieb_4","Frankfurt am Main",5,"2021-05-02"]
[123,1,250,120,"Vertrieb_3","Köln",5,"2021-05-05"]
[126,1,250,120,"Vertrieb_2","München",5,"2021-05-08"]
[129,1,250,120,"Vertrieb_1","Hamburg",5,"2021-05-11"]
[132,1,250,120,"Vertrieb_4","Frankfurt am Main",5,"2021-05-14"]
[135,1,250,120,"Vertrieb_3","Köln",5,"2021-05-17"]
[138,1,250,120,"Vertrieb_2","München",5,"2021-05-20"]
[141,1,250,120,"Vertrieb_1","Hamburg",5,"2021-05-23"]
[144,1,250,120,"Vertrieb_4","Frankfurt am Main",5,"2021-05-26"]
[146,1,250,120,"Vertrieb_2","München",5,"2021-05-28"]
[149,1,250,120,"Vertrieb_1","Hamburg",5,"2021-05-31"]
[152,1,250,120,"Vertrieb_4","Frankfurt am Main",6,"2021-06-03"]
[155,1,250,120,"Vertrieb_3","Köln",6,"2021-06-06"]
[158,1,250,120,"Vertrieb_2","München",6,"2021-06-09"]
[161,1,250,120,"Vertrieb_1","Hamburg",6,"2021-06-12"]
[164,1,250,120,"Vertrieb_4","Frankfurt am Main",6,"2021-06-15"]
[167,1,250,120,"Vertrieb_3","Köln",6,"2021-06-18"]
[170,1,250,120,"Vertrieb_2","München",6,"2021-06-21"]
[173,1,250,120,"Vertrieb_1","Hamburg",6,"2021-06-24"]
[176,1,250,120,"Vertrieb_4","Frankfurt am Main",6,"2021-06-27"]
[178,1,250,120,"Vertrieb_2","München",6,"2021-06-29"]
[181,1,250,120,"Vertrieb_1","Hamburg",7,"2021-07-02"]
[184,1,250,120,"Vertrieb_4","Frankfurt am Main",7,"2021-07-05"]
[187,1,250,120,"Vertrieb_3","Köln",7,"2021-07-08"]
[190,1,250,120,"Vertrieb_2","München",7,"2021-07-11"]
[193,1,250,120,"Vertrieb_1","Hamburg",7,"2021-07-14"]
[196,1,250,120,"Vertrieb_4","Frankfurt am Main",7,"2021-07-17"]
[199,1,250,120,"Vertrieb_3","Köln",7,"2021-07-20"]
[202,1,250,120,"Vertrieb_2","München",7,"2021-07-23"]
[205,1,250,120,"Vertrieb_1","Hamburg",7,"2021-07-26"]
[210,1,250,120,"Vertrieb_2","München",7,"2021-07-31"]
[213,1,250,120,"Vertrieb_1","Hamburg",8,"2021-08-03"]
[216,1,250,120,"Vertrieb_4","Frankfurt am Main",8,"2021-08-06"]
[219,1,250,120,"Vertrieb_3","Köln",8,"2021-08-09"]
[222,1,250,120,"Vertrieb_2","München",8,"2021-08-12"]
[225,1,250,120,"Vertrieb_1","Hamburg",8,"2021-08-15"]
[228,1,250,120,"Vertrieb_4","Frankfurt am Main",8,"2021-08-18"]
[231,1,250,120,"Vertrieb_3","Köln",8,"2021-08-21"]
[234,1,250,120,"Vertrieb_2","München",8,"2021-08-24"]
[237,1,250,120,"Vertrieb_1","Hamburg",8,"2021-08-27"]
[241,1,250,120,"Vertrieb_1","Hamburg",8,"2021-08-31"]
[244,1,250,120,"Vertrieb_4","Frankfurt am Main",9,"2021-09-03"]
[247,1,250,120,"Vertrieb_3","Köln",9,"2021-09-06"]
[250,1,250,120,"Vertrieb_2","München",9,"2021-09-09"]
[253,1,250,120,"Vertrieb_1","Hamburg",9,"2021-09-12"]
[256,1,250,120,"Vertrieb_4","Frankfurt am Main",9,"2021-09-15"]
[259,1,250,120,"Vertrieb_3","Köln",9,"2021-09-18"]
[262,1,250,120,"Vertrieb_2","München",9,"2021-09-21"]
[265,1,250,120,"Vertrieb_1","Hamburg",9,"2021-09-24"]
[268,1,250,120,"Vertrieb_4","Frankfurt am Main",9,"2021-09-27"]
[270,1,250,120,"Vertrieb_2","München",9,"2021-09-29"]
[273,1,250,120,"Vertrieb_1","Hamburg",10,"2021-10-02"]
[276,1,250,120,"Vertrieb_4","Frankfurt am Main",10,"2021-10-05"]
[279,1,250,120,"Vertrieb_3","Köln",10,"2021-10-08"]
[282,1,250,120,"Vertrieb_2","München",10,"2021-10-11"]
[285,1,250,120,"Vertrieb_1","Hamburg",10,"2021-10-14"]
[288,1,250,120,"Vertrieb_4","Frankfurt am Main",10,"2021-10-17"]
[291,1,250,120,"Vertrieb_3","Köln",10,"2021-10-20"]
[294,1,250,120,"Vertrieb_2","München",10,"2021-10-23"]
[297,1,250,120,"Vertrieb_1","Hamburg",10,"2021-10-26"]
[300,1,250,120,"Vertrieb_4","Frankfurt am Main",10,"2021-10-29"]
[302,1,250,120,"Vertrieb_2","München",10,"2021-10-31"]
[305,1,250,120,"Vertrieb_1","Hamburg",11,"2021-11-03"]
[308,1,250,120,"Vertrieb_4","Frankfurt am Main",11,"2021-11-06"]
[311,1,250,120,"Vertrieb_3","Köln",11,"2021-11-09"]
[314,1,250,120,"Vertrieb_2","München",11,"2021-11-12"]
[317,1,250,120,"Vertrieb_1","Hamburg",11,"2021-11-15"]
[320,1,250,120,"Vertrieb_4","Frankfurt am Main",11,"2021-11-18"]
[323,1,250,120,"Vertrieb_3","Köln",11,"2021-11-21"]
[326,1,250,120,"Vertrieb_2","München",11,"2021-11-24"]
[329,1,250,120,"Vertrieb_1","Hamburg",11,"2021-11-27"]
[334,1,250,120,"Vertrieb_2","München",12,"2021-12-02"]
[337,1,250,120,"Vertrieb_1","Hamburg",12,"2021-12-05"]
[340,1,250,120,"Vertrieb_4","Frankfurt am Main",12,"2021-12-08"]
[343,1,250,120,"Vertrieb_3","Köln",12,"2021-12-11"]
[346,1,250,120,"Vertrieb_2","München",12,"2021-12-14"]
[349,1,250,120,"Vertrieb_1","Hamburg",12,"2021-12-17"]
[352,1,250,120,"Vertrieb_4","Frankfurt am Main",12,"2021-12-20"]
[355,1,250,120,"Vertrieb_3","Köln",12,"2021-12-23"]
[358,1,250,120,"Vertrieb_2","München",12,"2021-12-26"]
[361,1,250,120,"Vertrieb_1","Hamburg",12,"2021-12-29"]
[null,{"$f":"SUBTOTAL(9,B247:B366)","v":120},{"$f":"SUBTOTAL(9,C247:C366)","v":30000},"120 Ergebnis"]
[null,{"$f":"SUBTOTAL(9,B2:B366)","v":363},{"$f":"SUBTOTAL(9,C2:C366)","v":66300},"Gesamtergebnis"]

{"sheet":"TE_Ort","index":14,"n_rows":369,"n_cols":8,"rows_kept":369,"cut":false,"hidden":false,"merged":[]}
["lfd. Nr.","Anzahl","Umsatz","Produkt","Vertrieb","Ort","Monat","Datum"]
[4,1,100,100,"Vertrieb_4","Frankfurt am Main",1,"2021-01-06"]
[8,1,100,100,"Vertrieb_4","Frankfurt am Main",1,"2021-01-10"]
[12,1,100,100,"Vertrieb_4","Frankfurt am Main",1,"2021-01-14"]
[16,1,200,110,"Vertrieb_4","Frankfurt am Main",1,"2021-01-18"]
[20,1,250,120,"Vertrieb_4","Frankfurt am Main",1,"2021-01-22"]
[24,1,200,110,"Vertrieb_4","Frankfurt am Main",1,"2021-01-26"]
[28,1,250,120,"Vertrieb_4","Frankfurt am Main",1,"2021-01-30"]
[32,1,100,100,"Vertrieb_4","Frankfurt am Main",2,"2021-02-03"]
[36,1,200,110,"Vertrieb_4","Frankfurt am Main",2,"2021-02-07"]
[40,1,250,120,"Vertrieb_4","Frankfurt am Main",2,"2021-02-11"]
[44,1,100,100,"Vertrieb_4","Frankfurt am Main",2,"2021-02-15"]
[48,1,200,110,"Vertrieb_4","Frankfurt am Main",2,"2021-02-19"]
[52,1,250,120,"Vertrieb_4","Frankfurt am Main",2,"2021-02-23"]
[56,1,200,110,"Vertrieb_4","Frankfurt am Main",2,"2021-02-27"]
[60,1,250,120,"Vertrieb_4","Frankfurt am Main",3,"2021-03-03"]
[64,1,100,100,"Vertrieb_4","Frankfurt am Main",3,"2021-03-07"]
[68,1,200,110,"Vertrieb_4","Frankfurt am Main",3,"2021-03-11"]
[72,1,250,120,"Vertrieb_4","Frankfurt am Main",3,"2021-03-15"]
[76,1,100,100,"Vertrieb_4","Frankfurt am Main",3,"2021-03-19"]
[80,1,200,110,"Vertrieb_4","Frankfurt am Main",3,"2021-03-23"]
[84,1,100,100,"Vertrieb_4","Frankfurt am Main",3,"2021-03-27"]
[88,1,200,110,"Vertrieb_4","Frankfurt am Main",3,"2021-03-31"]
[92,1,250,120,"Vertrieb_4","Frankfurt am Main",4,"2021-04-04"]
[96,1,100,100,"Vertrieb_4","Frankfurt am Main",4,"2021-04-08"]
[100,1,200,110,"Vertrieb_4","Frankfurt am Main",4,"2021-04-12"]
[104,1,250,120,"Vertrieb_4","Frankfurt am Main",4,"2021-04-16"]
[108,1,100,100,"Vertrieb_4","Frankfurt am Main",4,"2021-04-20"]
[112,1,200,110,"Vertrieb_4","Frankfurt am Main",4,"2021-04-24"]
[116,1,200,110,"Vertrieb_4","Frankfurt am Main",4,"2021-04-28"]
[120,1,250,120,"Vertrieb_4","Frankfurt am Main",5,"2021-05-02"]
[124,1,100,100,"Vertrieb_4","Frankfurt am Main",5,"2021-05-06"]
[128,1,200,110,"Vertrieb_4","Frankfurt am Main",5,"2021-05-10"]
[132,1,250,120,"Vertrieb_4","Frankfurt am Main",5,"2021-05-14"]
[136,1,100,100,"Vertrieb_4","Frankfurt am Main",5,"2021-05-18"]
[140,1,200,110,"Vertrieb_4","Frankfurt am Main",5,"2021-05-22"]
[144,1,250,120,"Vertrieb_4","Frankfurt am Main",5,"2021-05-26"]
[148,1,200,110,"Vertrieb_4","Frankfurt am Main",5,"2021-05-30"]
[152,1,250,120,"Vertrieb_4","Frankfurt am Main",6,"2021-06-03"]
[156,1,100,100,"Vertrieb_4","Frankfurt am Main",6,"2021-06-07"]
[160,1,200,110,"Vertrieb_4","Frankfurt am Main",6,"2021-06-11"]
[164,1,250,120,"Vertrieb_4","Frankfurt am Main",6,"2021-06-15"]
[168,1,100,100,"Vertrieb_4","Frankfurt am Main",6,"2021-06-19"]
[172,1,200,110,"Vertrieb_4","Frankfurt am Main",6,"2021-06-23"]
[176,1,250,120,"Vertrieb_4","Frankfurt am Main",6,"2021-06-27"]
[180,1,200,110,"Vertrieb_4","Frankfurt am Main",7,"2021-07-01"]
[184,1,250,120,"Vertrieb_4","Frankfurt am Main",7,"2021-07-05"]
[188,1,100,100,"Vertrieb_4","Frankfurt am Main",7,"2021-07-09"]
[192,1,200,110,"Vertrieb_4","Frankfurt am Main",7,"2021-07-13"]
[196,1,250,120,"Vertrieb_4","Frankfurt am Main",7,"2021-07-17"]
[200,1,100,100,"Vertrieb_4","Frankfurt am Main",7,"2021-07-21"]
[204,1,200,110,"Vertrieb_4","Frankfurt am Main",7,"2021-07-25"]
[208,1,100,100,"Vertrieb_4","Frankfurt am Main",7,"2021-07-29"]
[212,1,200,110,"Vertrieb_4","Frankfurt am Main",8,"2021-08-02"]
[216,1,250,120,"Vertrieb_4","Frankfurt am Main",8,"2021-08-06"]
[220,1,100,100,"Vertrieb_4","Frankfurt am Main",8,"2021-08-10"]
[224,1,200,110,"Vertrieb_4","Frankfurt am Main",8,"2021-08-14"]
[228,1,250,120,"Vertrieb_4","Frankfurt am Main",8,"2021-08-18"]
[232,1,100,100,"Vertrieb_4","Frankfurt am Main",8,"2021-08-22"]
[236,1,200,110,"Vertrieb_4","Frankfurt am Main",8,"2021-08-26"]
[240,1,200,110,"Vertrieb_4","Frankfurt am Main",8,"2021-08-30"]
[244,1,250,120,"Vertrieb_4","Frankfurt am Main",9,"2021-09-03"]
[248,1,100,100,"Vertrieb_4","Frankfurt am Main",9,"2021-09-07"]
[252,1,200,110,"Vertrieb_4","Frankfurt am Main",9,"2021-09-11"]
[256,1,250,120,"Vertrieb_4","Frankfurt am Main",9,"2021-09-15"]
[260,1,100,100,"Vertrieb_4","Frankfurt am Main",9,"2021-09-19"]
[264,1,200,110,"Vertrieb_4","Frankfurt am Main",9,"2021-09-23"]
[268,1,250,120,"Vertrieb_4","Frankfurt am Main",9,"2021-09-27"]
[272,1,200,110,"Vertrieb_4","Frankfurt am Main",10,"2021-10-01"]
[276,1,250,120,"Vertrieb_4","Frankfurt am Main",10,"2021-10-05"]
[280,1,100,100,"Vertrieb_4","Frankfurt am Main",10,"2021-10-09"]
[284,1,200,110,"Vertrieb_4","Frankfurt am Main",10,"2021-10-13"]
[288,1,250,120,"Vertrieb_4","Frankfurt am Main",10,"2021-10-17"]
[292,1,100,100,"Vertrieb_4","Frankfurt am Main",10,"2021-10-21"]
[296,1,200,110,"Vertrieb_4","Frankfurt am Main",10,"2021-10-25"]
[300,1,250,120,"Vertrieb_4","Frankfurt am Main",10,"2021-10-29"]
[304,1,200,110,"Vertrieb_4","Frankfurt am Main",11,"2021-11-02"]
[308,1,250,120,"Vertrieb_4","Frankfurt am Main",11,"2021-11-06"]
[312,1,100,100,"Vertrieb_4","Frankfurt am Main",11,"2021-11-10"]
[316,1,200,110,"Vertrieb_4","Frankfurt am Main",11,"2021-11-14"]
[320,1,250,120,"Vertrieb_4","Frankfurt am Main",11,"2021-11-18"]
[324,1,100,100,"Vertrieb_4","Frankfurt am Main",11,"2021-11-22"]
[328,1,200,110,"Vertrieb_4","Frankfurt am Main",11,"2021-11-26"]
[332,1,100,100,"Vertrieb_4","Frankfurt am Main",11,"2021-11-30"]
[336,1,200,110,"Vertrieb_4","Frankfurt am Main",12,"2021-12-04"]
[340,1,250,120,"Vertrieb_4","Frankfurt am Main",12,"2021-12-08"]
[344,1,100,100,"Vertrieb_4","Frankfurt am Main",12,"2021-12-12"]
[348,1,200,110,"Vertrieb_4","Frankfurt am Main",12,"2021-12-16"]
[352,1,250,120,"Vertrieb_4","Frankfurt am Main",12,"2021-12-20"]
[356,1,100,100,"Vertrieb_4","Frankfurt am Main",12,"2021-12-24"]
[360,1,200,110,"Vertrieb_4","Frankfurt am Main",12,"2021-12-28"]
[null,{"$f":"SUBTOTAL(9,B2:B91)","v":90},{"$f":"SUBTOTAL(9,C2:C91)","v":16600},null,null,"Frankfurt am Main Ergebnis"]
[1,1,100,100,"Vertrieb_1","Hamburg",1,"2021-01-03"]
[5,1,200,110,"Vertrieb_1","Hamburg",1,"2021-01-07"]
[9,1,200,110,"Vertrieb_1","Hamburg",1,"2021-01-11"]
[13,1,200,110,"Vertrieb_1","Hamburg",1,"2021-01-15"]
[17,1,250,120,"Vertrieb_1","Hamburg",1,"2021-01-19"]
[21,1,100,100,"Vertrieb_1","Hamburg",1,"2021-01-23"]
[25,1,250,120,"Vertrieb_1","Hamburg",1,"2021-01-27"]
[29,1,100,100,"Vertrieb_1","Hamburg",1,"2021-01-31"]
[33,1,200,110,"Vertrieb_1","Hamburg",2,"2021-02-04"]
[37,1,250,120,"Vertrieb_1","Hamburg",2,"2021-02-08"]
[41,1,100,100,"Vertrieb_1","Hamburg",2,"2021-02-12"]
[45,1,200,110,"Vertrieb_1","Hamburg",2,"2021-02-16"]
[49,1,250,120,"Vertrieb_1","Hamburg",2,"2021-02-20"]
[53,1,200,110,"Vertrieb_1","Hamburg",2,"2021-02-24"]
[57,1,250,120,"Vertrieb_1","Hamburg",2,"2021-02-28"]
[61,1,100,100,"Vertrieb_1","Hamburg",3,"2021-03-04"]
[65,1,200,110,"Vertrieb_1","Hamburg",3,"2021-03-08"]
[69,1,250,120,"Vertrieb_1","Hamburg",3,"2021-03-12"]
[73,1,100,100,"Vertrieb_1","Hamburg",3,"2021-03-16"]
[77,1,200,110,"Vertrieb_1","Hamburg",3,"2021-03-20"]
[81,1,250,120,"Vertrieb_1","Hamburg",3,"2021-03-24"]
[85,1,200,110,"Vertrieb_1","Hamburg",3,"2021-03-28"]
[89,1,250,120,"Vertrieb_1","Hamburg",4,"2021-04-01"]
[93,1,100,100,"Vertrieb_1","Hamburg",4,"2021-04-05"]
[97,1,200,110,"Vertrieb_1","Hamburg",4,"2021-04-09"]
[101,1,250,120,"Vertrieb_1","Hamburg",4,"2021-04-13"]
[105,1,100,100,"Vertrieb_1","Hamburg",4,"2021-04-17"]
[109,1,200,110,"Vertrieb_1","Hamburg",4,"2021-04-21"]
[113,1,250,120,"Vertrieb_1","Hamburg",4,"2021-04-25"]
[117,1,250,120,"Vertrieb_1","Hamburg",4,"2021-04-29"]
[121,1,100,100,"Vertrieb_1","Hamburg",5,"2021-05-03"]
[125,1,200,110,"Vertrieb_1","Hamburg",5,"2021-05-07"]
[129,1,250,120,"Vertrieb_1","Hamburg",5,"2021-05-11"]
[133,1,100,100,"Vertrieb_1","Hamburg",5,"2021-05-15"]
[137,1,200,110,"Vertrieb_1","Hamburg",5,"2021-05-19"]
[141,1,250,120,"Vertrieb_1","Hamburg",5,"2021-05-23"]
[145,1,100,100,"Vertrieb_1","Hamburg",5,"2021-05-27"]
[149,1,250,120,"Vertrieb_1","Hamburg",5,"2021-05-31"]
[153,1,100,100,"Vertrieb_1","Hamburg",6,"2021-06-04"]
[157,1,200,110,"Vertrieb_1","Hamburg",6,"2021-06-08"]
[161,1,250,120,"Vertrieb_1","Hamburg",6,"2021-06-12"]
[165,1,100,100,"Vertrieb_1","Hamburg",6,"2021-06-16"]
[169,1,200,110,"Vertrieb_1","Hamburg",6,"2021-06-20"]
[173,1,250,120,"Vertrieb_1","Hamburg",6,"2021-06-24"]
[177,1,200,110,"Vertrieb_1","Hamburg",6,"2021-06-28"]
[181,1,250,120,"Vertrieb_1","Hamburg",7,"2021-07-02"]
[185,1,100,100,"Vertrieb_1","Hamburg",7,"2021-07-06"]
[189,1,200,110,"Vertrieb_1","Hamburg",7,"2021-07-10"]
[193,1,250,120,"Vertrieb_1","Hamburg",7,"2021-07-14"]
[197,1,100,100,"Vertrieb_1","Hamburg",7,"2021-07-18"]
[201,1,200,110,"Vertrieb_1","Hamburg",7,"2021-07-22"]
[205,1,250,120,"Vertrieb_1","Hamburg",7,"2021-07-26"]
[209,1,200,110,"Vertrieb_1","Hamburg",7,"2021-07-30"]
[213,1,250,120,"Vertrieb_1","Hamburg",8,"2021-08-03"]
[217,1,100,100,"Vertrieb_1","Hamburg",8,"2021-08-07"]
[221,1,200,110,"Vertrieb_1","Hamburg",8,"2021-08-11"]
[225,1,250,120,"Vertrieb_1","Hamburg",8,"2021-08-15"]
[229,1,100,100,"Vertrieb_1","Hamburg",8,"2021-08-19"]
[233,1,200,110,"Vertrieb_1","Hamburg",8,"2021-08-23"]
[237,1,250,120,"Vertrieb_1","Hamburg",8,"2021-08-27"]
[241,1,250,120,"Vertrieb_1","Hamburg",8,"2021-08-31"]
[245,1,100,100,"Vertrieb_1","Hamburg",9,"2021-09-04"]
[249,1,200,110,"Vertrieb_1","Hamburg",9,"2021-09-08"]
[253,1,250,120,"Vertrieb_1","Hamburg",9,"2021-09-12"]
[257,1,100,100,"Vertrieb_1","Hamburg",9,"2021-09-16"]
[261,1,200,110,"Vertrieb_1","Hamburg",9,"2021-09-20"]
[265,1,250,120,"Vertrieb_1","Hamburg",9,"2021-09-24"]
[269,1,100,100,"Vertrieb_1","Hamburg",9,"2021-09-28"]
[273,1,250,120,"Vertrieb_1","Hamburg",10,"2021-10-02"]
[277,1,100,100,"Vertrieb_1","Hamburg",10,"2021-10-06"]
[281,1,200,110,"Vertrieb_1","Hamburg",10,"2021-10-10"]
[285,1,250,120,"Vertrieb_1","Hamburg",10,"2021-10-14"]
[289,1,100,100,"Vertrieb_1","Hamburg",10,"2021-10-18"]
[293,1,200,110,"Vertrieb_1","Hamburg",10,"2021-10-22"]
[297,1,250,120,"Vertrieb_1","Hamburg",10,"2021-10-26"]
[301,1,200,110,"Vertrieb_1","Hamburg",10,"2021-10-30"]
[305,1,250,120,"Vertrieb_1","Hamburg",11,"2021-11-03"]
[309,1,100,100,"Vertrieb_1","Hamburg",11,"2021-11-07"]
[313,1,200,110,"Vertrieb_1","Hamburg",11,"2021-11-11"]
[317,1,250,120,"Vertrieb_1","Hamburg",11,"2021-11-15"]
[321,1,100,100,"Vertrieb_1","Hamburg",11,"2021-11-19"]
[325,1,200,110,"Vertrieb_1","Hamburg",11,"2021-11-23"]
[329,1,250,120,"Vertrieb_1","Hamburg",11,"2021-11-27"]
[333,1,200,110,"Vertrieb_1","Hamburg",12,"2021-12-01"]
[337,1,250,120,"Vertrieb_1","Hamburg",12,"2021-12-05"]
[341,1,100,100,"Vertrieb_1","Hamburg",12,"2021-12-09"]
[345,1,200,110,"Vertrieb_1","Hamburg",12,"2021-12-13"]
[349,1,250,120,"Vertrieb_1","Hamburg",12,"2021-12-17"]
[353,1,100,100,"Vertrieb_1","Hamburg",12,"2021-12-21"]
[357,1,200,110,"Vertrieb_1","Hamburg",12,"2021-12-25"]
[361,1,250,120,"Vertrieb_1","Hamburg",12,"2021-12-29"]
[null,{"$f":"SUBTOTAL(9,B93:B183)","v":91},{"$f":"SUBTOTAL(9,C93:C183)","v":17300},null,null,"Hamburg Ergebnis"]
[3,1,250,120,"Vertrieb_3","Köln",1,"2021-01-05"]
[7,1,250,120,"Vertrieb_3","Köln",1,"2021-01-09"]
[11,1,250,120,"Vertrieb_3","Köln",1,"2021-01-13"]
[15,1,100,100,"Vertrieb_3","Köln",1,"2021-01-17"]
[19,1,200,110,"Vertrieb_3","Köln",1,"2021-01-21"]
[23,1,100,100,"Vertrieb_3","Köln",1,"2021-01-25"]
[27,1,200,110,"Vertrieb_3","Köln",1,"2021-01-29"]
[31,1,250,120,"Vertrieb_3","Köln",2,"2021-02-02"]
[35,1,100,100,"Vertrieb_3","Köln",2,"2021-02-06"]
[39,1,200,110,"Vertrieb_3","Köln",2,"2021-02-10"]
[43,1,250,120,"Vertrieb_3","Köln",2,"2021-02-14"]
[47,1,100,100,"Vertrieb_3","Köln",2,"2021-02-18"]
[51,1,200,110,"Vertrieb_3","Köln",2,"2021-02-22"]
[55,1,100,100,"Vertrieb_3","Köln",2,"2021-02-26"]
[59,1,200,110,"Vertrieb_3","Köln",3,"2021-03-02"]
[63,1,250,120,"Vertrieb_3","Köln",3,"2021-03-06"]
[67,1,100,100,"Vertrieb_3","Köln",3,"2021-03-10"]
[71,1,200,110,"Vertrieb_3","Köln",3,"2021-03-14"]
[75,1,250,120,"Vertrieb_3","Köln",3,"2021-03-18"]
[79,1,100,100,"Vertrieb_3","Köln",3,"2021-03-22"]
[83,1,200,110,"Vertrieb_3","Köln",3,"2021-03-26"]
[87,1,100,100,"Vertrieb_3","Köln",3,"2021-03-30"]
[91,1,200,110,"Vertrieb_3","Köln",4,"2021-04-03"]
[95,1,250,120,"Vertrieb_3","Köln",4,"2021-04-07"]
[99,1,100,100,"Vertrieb_3","Köln",4,"2021-04-11"]
[103,1,200,110,"Vertrieb_3","Köln",4,"2021-04-15"]
[107,1,250,120,"Vertrieb_3","Köln",4,"2021-04-19"]
[111,1,100,100,"Vertrieb_3","Köln",4,"2021-04-23"]
[115,1,100,100,"Vertrieb_3","Köln",4,"2021-04-27"]
[119,1,200,110,"Vertrieb_3","Köln",5,"2021-05-01"]
[123,1,250,120,"Vertrieb_3","Köln",5,"2021-05-05"]
[127,1,100,100,"Vertrieb_3","Köln",5,"2021-05-09"]
[131,1,200,110,"Vertrieb_3","Köln",5,"2021-05-13"]
[135,1,250,120,"Vertrieb_3","Köln",5,"2021-05-17"]
[139,1,100,100,"Vertrieb_3","Köln",5,"2021-05-21"]
[143,1,200,110,"Vertrieb_3","Köln",5,"2021-05-25"]
[147,1,100,100,"Vertrieb_3","Köln",5,"2021-05-29"]
[151,1,200,110,"Vertrieb_3","Köln",6,"2021-06-02"]
[155,1,250,120,"Vertrieb_3","Köln",6,"2021-06-06"]
[159,1,100,100,"Vertrieb_3","Köln",6,"2021-06-10"]
[163,1,200,110,"Vertrieb_3","Köln",6,"2021-06-14"]
[167,1,250,120,"Vertrieb_3","Köln",6,"2021-06-18"]
[171,1,100,100,"Vertrieb_3","Köln",6,"2021-06-22"]
[175,1,200,110,"Vertrieb_3","Köln",6,"2021-06-26"]
[179,1,100,100,"Vertrieb_3","Köln",6,"2021-06-30"]
[183,1,200,110,"Vertrieb_3","Köln",7,"2021-07-04"]
[187,1,250,120,"Vertrieb_3","Köln",7,"2021-07-08"]
[191,1,100,100,"Vertrieb_3","Köln",7,"2021-07-12"]
[195,1,200,110,"Vertrieb_3","Köln",7,"2021-07-16"]
[199,1,250,120,"Vertrieb_3","Köln",7,"2021-07-20"]
[203,1,100,100,"Vertrieb_3","Köln",7,"2021-07-24"]
[207,1,200,110,"Vertrieb_3","Köln",7,"2021-07-28"]
[211,1,100,100,"Vertrieb_3","Köln",8,"2021-08-01"]
[215,1,200,110,"Vertrieb_3","Köln",8,"2021-08-05"]
[219,1,250,120,"Vertrieb_3","Köln",8,"2021-08-09"]
[223,1,100,100,"Vertrieb_3","Köln",8,"2021-08-13"]
[227,1,200,110,"Vertrieb_3","Köln",8,"2021-08-17"]
[231,1,250,120,"Vertrieb_3","Köln",8,"2021-08-21"]
[235,1,100,100,"Vertrieb_3","Köln",8,"2021-08-25"]
[239,1,100,100,"Vertrieb_3","Köln",8,"2021-08-29"]
[243,1,200,110,"Vertrieb_3","Köln",9,"2021-09-02"]
[247,1,250,120,"Vertrieb_3","Köln",9,"2021-09-06"]
[251,1,100,100,"Vertrieb_3","Köln",9,"2021-09-10"]
[255,1,200,110,"Vertrieb_3","Köln",9,"2021-09-14"]
[259,1,250,120,"Vertrieb_3","Köln",9,"2021-09-18"]
[263,1,100,100,"Vertrieb_3","Köln",9,"2021-09-22"]
[267,1,200,110,"Vertrieb_3","Köln",9,"2021-09-26"]
[271,1,100,100,"Vertrieb_3","Köln",9,"2021-09-30"]
[275,1,200,110,"Vertrieb_3","Köln",10,"2021-10-04"]
[279,1,250,120,"Vertrieb_3","Köln",10,"2021-10-08"]
[283,1,100,100,"Vertrieb_3","Köln",10,"2021-10-12"]
[287,1,200,110,"Vertrieb_3","Köln",10,"2021-10-16"]
[291,1,250,120,"Vertrieb_3","Köln",10,"2021-10-20"]
[295,1,100,100,"Vertrieb_3","Köln",10,"2021-10-24"]
[299,1,200,110,"Vertrieb_3","Köln",10,"2021-10-28"]
[303,1,100,100,"Vertrieb_3","Köln",11,"2021-11-01"]
[307,1,200,110,"Vertrieb_3","Köln",11,"2021-11-05"]
[311,1,250,120,"Vertrieb_3","Köln",11,"2021-11-09"]
[315,1,100,100,"Vertrieb_3","Köln",11,"2021-11-13"]
[319,1,200,110,"Vertrieb_3","Köln",11,"2021-11-17"]
[323,1,250,120,"Vertrieb_3","Köln",11,"2021-11-21"]
[327,1,100,100,"Vertrieb_3","Köln",11,"2021-11-25"]
[331,1,200,110,"Vertrieb_3","Köln",11,"2021-11-29"]
[335,1,100,100,"Vertrieb_3","Köln",12,"2021-12-03"]
[339,1,200,110,"Vertrieb_3","Köln",12,"2021-12-07"]
[343,1,250,120,"Vertrieb_3","Köln",12,"2021-12-11"]
[347,1,100,100,"Vertrieb_3","Köln",12,"2021-12-15"]
[351,1,200,110,"Vertrieb_3","Köln",12,"2021-12-19"]
[355,1,250,120,"Vertrieb_3","Köln",12,"2021-12-23"]
[359,1,100,100,"Vertrieb_3","Köln",12,"2021-12-27"]
[363,1,100,100,"Vertrieb_3","Köln",12,"2021-12-31"]
[null,{"$f":"SUBTOTAL(9,B185:B275)","v":91},{"$f":"SUBTOTAL(9,C185:C275)","v":15950},null,null,"Köln Ergebnis"]
[2,1,200,110,"Vertrieb_2","München",1,"2021-01-04"]
[6,1,200,110,"Vertrieb_2","München",1,"2021-01-08"]
[10,1,250,120,"Vertrieb_2","München",1,"2021-01-12"]
[14,1,250,120,"Vertrieb_2","München",1,"2021-01-16"]
[18,1,100,100,"Vertrieb_2","München",1,"2021-01-20"]
[22,1,250,120,"Vertrieb_2","München",1,"2021-01-24"]
[26,1,100,100,"Vertrieb_2","München",1,"2021-01-28"]
[30,1,200,110,"Vertrieb_2","München",2,"2021-02-01"]
[34,1,250,120,"Vertrieb_2","München",2,"2021-02-05"]
[38,1,100,100,"Vertrieb_2","München",2,"2021-02-09"]
[42,1,200,110,"Vertrieb_2","München",2,"2021-02-13"]
[46,1,250,120,"Vertrieb_2","München",2,"2021-02-17"]
[50,1,100,100,"Vertrieb_2","München",2,"2021-02-21"]
[54,1,250,120,"Vertrieb_2","München",2,"2021-02-25"]
[58,1,100,100,"Vertrieb_2","München",3,"2021-03-01"]
[62,1,200,110,"Vertrieb_2","München",3,"2021-03-05"]
[66,1,250,120,"Vertrieb_2","München",3,"2021-03-09"]
[70,1,100,100,"Vertrieb_2","München",3,"2021-03-13"]
[74,1,200,110,"Vertrieb_2","München",3,"2021-03-17"]
[78,1,250,120,"Vertrieb_2","München",3,"2021-03-21"]
[82,1,100,100,"Vertrieb_2","München",3,"2021-03-25"]
[86,1,250,120,"Vertrieb_2","München",3,"2021-03-29"]
[90,1,100,100,"Vertrieb_2","München",4,"2021-04-02"]
[94,1,200,110,"Vertrieb_2","München",4,"2021-04-06"]
[98,1,250,120,"Vertrieb_2","München",4,"2021-04-10"]
[102,1,100,100,"Vertrieb_2","München",4,"2021-04-14"]
[106,1,200,110,"Vertrieb_2","München",4,"2021-04-18"]
[110,1,250,120,"Vertrieb_2","München",4,"2021-04-22"]
[114,1,100,100,"Vertrieb_2","München",4,"2021-04-26"]
[118,1,100,100,"Vertrieb_2","München",4,"2021-04-30"]
[122,1,200,110,"Vertrieb_2","München",5,"2021-05-04"]
[126,1,250,120,"Vertrieb_2","München",5,"2021-05-08"]
[130,1,100,100,"Vertrieb_2","München",5,"2021-05-12"]
[134,1,200,110,"Vertrieb_2","München",5,"2021-05-16"]
[138,1,250,120,"Vertrieb_2","München",5,"2021-05-20"]
[142,1,100,100,"Vertrieb_2","München",5,"2021-05-24"]
[146,1,250,120,"Vertrieb_2","München",5,"2021-05-28"]
[150,1,100,100,"Vertrieb_2","München",6,"2021-06-01"]
[154,1,200,110,"Vertrieb_2","München",6,"2021-06-05"]
[158,1,250,120,"Vertrieb_2","München",6,"2021-06-09"]
[162,1,100,100,"Vertrieb_2","München",6,"2021-06-13"]
[166,1,200,110,"Vertrieb_2","München",6,"2021-06-17"]
[170,1,250,120,"Vertrieb_2","München",6,"2021-06-21"]
[174,1,100,100,"Vertrieb_2","München",6,"2021-06-25"]
[178,1,250,120,"Vertrieb_2","München",6,"2021-06-29"]
[182,1,100,100,"Vertrieb_2","München",7,"2021-07-03"]
[186,1,200,110,"Vertrieb_2","München",7,"2021-07-07"]
[190,1,250,120,"Vertrieb_2","München",7,"2021-07-11"]
[194,1,100,100,"Vertrieb_2","München",7,"2021-07-15"]
[198,1,200,110,"Vertrieb_2","München",7,"2021-07-19"]
[202,1,250,120,"Vertrieb_2","München",7,"2021-07-23"]
[206,1,100,100,"Vertrieb_2","München",7,"2021-07-27"]
[210,1,250,120,"Vertrieb_2","München",7,"2021-07-31"]
[214,1,100,100,"Vertrieb_2","München",8,"2021-08-04"]
[218,1,200,110,"Vertrieb_2","München",8,"2021-08-08"]
[222,1,250,120,"Vertrieb_2","München",8,"2021-08-12"]
[226,1,100,100,"Vertrieb_2","München",8,"2021-08-16"]
[230,1,200,110,"Vertrieb_2","München",8,"2021-08-20"]
[234,1,250,120,"Vertrieb_2","München",8,"2021-08-24"]
[238,1,100,100,"Vertrieb_2","München",8,"2021-08-28"]
[242,1,100,100,"Vertrieb_2","München",9,"2021-09-01"]
[246,1,200,110,"Vertrieb_2","München",9,"2021-09-05"]
[250,1,250,120,"Vertrieb_2","München",9,"2021-09-09"]
[254,1,100,100,"Vertrieb_2","München",9,"2021-09-13"]
[258,1,200,110,"Vertrieb_2","München",9,"2021-09-17"]
[262,1,250,120,"Vertrieb_2","München",9,"2021-09-21"]
[266,1,100,100,"Vertrieb_2","München",9,"2021-09-25"]
[270,1,250,120,"Vertrieb_2","München",9,"2021-09-29"]
[274,1,100,100,"Vertrieb_2","München",10,"2021-10-03"]
[278,1,200,110,"Vertrieb_2","München",10,"2021-10-07"]
[282,1,250,120,"Vertrieb_2","München",10,"2021-10-11"]
[286,1,100,100,"Vertrieb_2","München",10,"2021-10-15"]
[290,1,200,110,"Vertrieb_2","München",10,"2021-10-19"]
[294,1,250,120,"Vertrieb_2","München",10,"2021-10-23"]
[298,1,100,100,"Vertrieb_2","München",10,"2021-10-27"]
[302,1,250,120,"Vertrieb_2","München",10,"2021-10-31"]
[306,1,100,100,"Vertrieb_2","München",11,"2021-11-04"]
[310,1,200,110,"Vertrieb_2","München",11,"2021-11-08"]
[314,1,250,120,"Vertrieb_2","München",11,"2021-11-12"]
[318,1,100,100,"Vertrieb_2","München",11,"2021-11-16"]
[322,1,200,110,"Vertrieb_2","München",11,"2021-11-20"]
[326,1,250,120,"Vertrieb_2","München",11,"2021-11-24"]
[330,1,100,100,"Vertrieb_2","München",11,"2021-11-28"]
[334,1,250,120,"Vertrieb_2","München",12,"2021-12-02"]
[338,1,100,100,"Vertrieb_2","München",12,"2021-12-06"]
[342,1,200,110,"Vertrieb_2","München",12,"2021-12-10"]
[346,1,250,120,"Vertrieb_2","München",12,"2021-12-14"]
[350,1,100,100,"Vertrieb_2","München",12,"2021-12-18"]
[354,1,200,110,"Vertrieb_2","München",12,"2021-12-22"]
[358,1,250,120,"Vertrieb_2","München",12,"2021-12-26"]
[362,1,100,100,"Vertrieb_2","München",12,"2021-12-30"]
[null,{"$f":"SUBTOTAL(9,B277:B367)","v":91},{"$f":"SUBTOTAL(9,C277:C367)","v":16450},null,null,"München Ergebnis"]
[null,{"$f":"SUBTOTAL(9,B2:B367)","v":363},{"$f":"SUBTOTAL(9,C2:C367)","v":66300},null,null,"Gesamtergebnis"]

{"sheet":"TE_Monat","index":15,"n_rows":377,"n_cols":8,"rows_kept":377,"cut":false,"hidden":false,"merged":[]}
["lfd. Nr.","Anzahl","Umsatz","Produkt","Vertrieb","Ort","Monat","Datum"]
[1,1,100,100,"Vertrieb_1","Hamburg",1,"2021-01-03"]
[2,1,200,110,"Vertrieb_2","München",1,"2021-01-04"]
[3,1,250,120,"Vertrieb_3","Köln",1,"2021-01-05"]
[4,1,100,100,"Vertrieb_4","Frankfurt am Main",1,"2021-01-06"]
[5,1,200,110,"Vertrieb_1","Hamburg",1,"2021-01-07"]
[6,1,200,110,"Vertrieb_2","München",1,"2021-01-08"]
[7,1,250,120,"Vertrieb_3","Köln",1,"2021-01-09"]
[8,1,100,100,"Vertrieb_4","Frankfurt am Main",1,"2021-01-10"]
[9,1,200,110,"Vertrieb_1","Hamburg",1,"2021-01-11"]
[10,1,250,120,"Vertrieb_2","München",1,"2021-01-12"]
[11,1,250,120,"Vertrieb_3","Köln",1,"2021-01-13"]
[12,1,100,100,"Vertrieb_4","Frankfurt am Main",1,"2021-01-14"]
[13,1,200,110,"Vertrieb_1","Hamburg",1,"2021-01-15"]
[14,1,250,120,"Vertrieb_2","München",1,"2021-01-16"]
[15,1,100,100,"Vertrieb_3","Köln",1,"2021-01-17"]
[16,1,200,110,"Vertrieb_4","Frankfurt am Main",1,"2021-01-18"]
[17,1,250,120,"Vertrieb_1","Hamburg",1,"2021-01-19"]
[18,1,100,100,"Vertrieb_2","München",1,"2021-01-20"]
[19,1,200,110,"Vertrieb_3","Köln",1,"2021-01-21"]
[20,1,250,120,"Vertrieb_4","Frankfurt am Main",1,"2021-01-22"]
[21,1,100,100,"Vertrieb_1","Hamburg",1,"2021-01-23"]
[22,1,250,120,"Vertrieb_2","München",1,"2021-01-24"]
[23,1,100,100,"Vertrieb_3","Köln",1,"2021-01-25"]
[24,1,200,110,"Vertrieb_4","Frankfurt am Main",1,"2021-01-26"]
[25,1,250,120,"Vertrieb_1","Hamburg",1,"2021-01-27"]
[26,1,100,100,"Vertrieb_2","München",1,"2021-01-28"]
[27,1,200,110,"Vertrieb_3","Köln",1,"2021-01-29"]
[28,1,250,120,"Vertrieb_4","Frankfurt am Main",1,"2021-01-30"]
[29,1,100,100,"Vertrieb_1","Hamburg",1,"2021-01-31"]
[null,{"$f":"SUBTOTAL(9,B2:B30)","v":29},{"$f":"SUBTOTAL(9,C2:C30)","v":5300},null,null,null,"1 Ergebnis"]
[30,1,200,110,"Vertrieb_2","München",2,"2021-02-01"]
[31,1,250,120,"Vertrieb_3","Köln",2,"2021-02-02"]
[32,1,100,100,"Vertrieb_4","Frankfurt am Main",2,"2021-02-03"]
[33,1,200,110,"Vertrieb_1","Hamburg",2,"2021-02-04"]
[34,1,250,120,"Vertrieb_2","München",2,"2021-02-05"]
[35,1,100,100,"Vertrieb_3","Köln",2,"2021-02-06"]
[36,1,200,110,"Vertrieb_4","Frankfurt am Main",2,"2021-02-07"]
[37,1,250,120,"Vertrieb_1","Hamburg",2,"2021-02-08"]
[38,1,100,100,"Vertrieb_2","München",2,"2021-02-09"]
[39,1,200,110,"Vertrieb_3","Köln",2,"2021-02-10"]
[40,1,250,120,"Vertrieb_4","Frankfurt am Main",2,"2021-02-11"]
[41,1,100,100,"Vertrieb_1","Hamburg",2,"2021-02-12"]
[42,1,200,110,"Vertrieb_2","München",2,"2021-02-13"]
[43,1,250,120,"Vertrieb_3","Köln",2,"2021-02-14"]
[44,1,100,100,"Vertrieb_4","Frankfurt am Main",2,"2021-02-15"]
[45,1,200,110,"Vertrieb_1","Hamburg",2,"2021-02-16"]
[46,1,250,120,"Vertrieb_2","München",2,"2021-02-17"]
[47,1,100,100,"Vertrieb_3","Köln",2,"2021-02-18"]
[48,1,200,110,"Vertrieb_4","Frankfurt am Main",2,"2021-02-19"]
[49,1,250,120,"Vertrieb_1","Hamburg",2,"2021-02-20"]
[50,1,100,100,"Vertrieb_2","München",2,"2021-02-21"]
[51,1,200,110,"Vertrieb_3","Köln",2,"2021-02-22"]
[52,1,250,120,"Vertrieb_4","Frankfurt am Main",2,"2021-02-23"]
[53,1,200,110,"Vertrieb_1","Hamburg",2,"2021-02-24"]
[54,1,250,120,"Vertrieb_2","München",2,"2021-02-25"]
[55,1,100,100,"Vertrieb_3","Köln",2,"2021-02-26"]
[56,1,200,110,"Vertrieb_4","Frankfurt am Main",2,"2021-02-27"]
[57,1,250,120,"Vertrieb_1","Hamburg",2,"2021-02-28"]
[null,{"$f":"SUBTOTAL(9,B32:B59)","v":28},{"$f":"SUBTOTAL(9,C32:C59)","v":5300},null,null,null,"2 Ergebnis"]
[58,1,100,100,"Vertrieb_2","München",3,"2021-03-01"]
[59,1,200,110,"Vertrieb_3","Köln",3,"2021-03-02"]
[60,1,250,120,"Vertrieb_4","Frankfurt am Main",3,"2021-03-03"]
[61,1,100,100,"Vertrieb_1","Hamburg",3,"2021-03-04"]
[62,1,200,110,"Vertrieb_2","München",3,"2021-03-05"]
[63,1,250,120,"Vertrieb_3","Köln",3,"2021-03-06"]
[64,1,100,100,"Vertrieb_4","Frankfurt am Main",3,"2021-03-07"]
[65,1,200,110,"Vertrieb_1","Hamburg",3,"2021-03-08"]
[66,1,250,120,"Vertrieb_2","München",3,"2021-03-09"]
[67,1,100,100,"Vertrieb_3","Köln",3,"2021-03-10"]
[68,1,200,110,"Vertrieb_4","Frankfurt am Main",3,"2021-03-11"]
[69,1,250,120,"Vertrieb_1","Hamburg",3,"2021-03-12"]
[70,1,100,100,"Vertrieb_2","München",3,"2021-03-13"]
[71,1,200,110,"Vertrieb_3","Köln",3,"2021-03-14"]
[72,1,250,120,"Vertrieb_4","Frankfurt am Main",3,"2021-03-15"]
[73,1,100,100,"Vertrieb_1","Hamburg",3,"2021-03-16"]
[74,1,200,110,"Vertrieb_2","München",3,"2021-03-17"]
[75,1,250,120,"Vertrieb_3","Köln",3,"2021-03-18"]
[76,1,100,100,"Vertrieb_4","Frankfurt am Main",3,"2021-03-19"]
[77,1,200,110,"Vertrieb_1","Hamburg",3,"2021-03-20"]
[78,1,250,120,"Vertrieb_2","München",3,"2021-03-21"]
[79,1,100,100,"Vertrieb_3","Köln",3,"2021-03-22"]
[80,1,200,110,"Vertrieb_4","Frankfurt am Main",3,"2021-03-23"]
[81,1,250,120,"Vertrieb_1","Hamburg",3,"2021-03-24"]
[82,1,100,100,"Vertrieb_2","München",3,"2021-03-25"]
[83,1,200,110,"Vertrieb_3","Köln",3,"2021-03-26"]
[84,1,100,100,"Vertrieb_4","Frankfurt am Main",3,"2021-03-27"]
[85,1,200,110,"Vertrieb_1","Hamburg",3,"2021-03-28"]
[86,1,250,120,"Vertrieb_2","München",3,"2021-03-29"]
[87,1,100,100,"Vertrieb_3","Köln",3,"2021-03-30"]
[88,1,200,110,"Vertrieb_4","Frankfurt am Main",3,"2021-03-31"]
[null,{"$f":"SUBTOTAL(9,B61:B91)","v":31},{"$f":"SUBTOTAL(9,C61:C91)","v":5550},null,null,null,"3 Ergebnis"]
[89,1,250,120,"Vertrieb_1","Hamburg",4,"2021-04-01"]
[90,1,100,100,"Vertrieb_2","München",4,"2021-04-02"]
[91,1,200,110,"Vertrieb_3","Köln",4,"2021-04-03"]
[92,1,250,120,"Vertrieb_4","Frankfurt am Main",4,"2021-04-04"]
[93,1,100,100,"Vertrieb_1","Hamburg",4,"2021-04-05"]
[94,1,200,110,"Vertrieb_2","München",4,"2021-04-06"]
[95,1,250,120,"Vertrieb_3","Köln",4,"2021-04-07"]
[96,1,100,100,"Vertrieb_4","Frankfurt am Main",4,"2021-04-08"]
[97,1,200,110,"Vertrieb_1","Hamburg",4,"2021-04-09"]
[98,1,250,120,"Vertrieb_2","München",4,"2021-04-10"]
[99,1,100,100,"Vertrieb_3","Köln",4,"2021-04-11"]
[100,1,200,110,"Vertrieb_4","Frankfurt am Main",4,"2021-04-12"]
[101,1,250,120,"Vertrieb_1","Hamburg",4,"2021-04-13"]
[102,1,100,100,"Vertrieb_2","München",4,"2021-04-14"]
[103,1,200,110,"Vertrieb_3","Köln",4,"2021-04-15"]
[104,1,250,120,"Vertrieb_4","Frankfurt am Main",4,"2021-04-16"]
[105,1,100,100,"Vertrieb_1","Hamburg",4,"2021-04-17"]
[106,1,200,110,"Vertrieb_2","München",4,"2021-04-18"]
[107,1,250,120,"Vertrieb_3","Köln",4,"2021-04-19"]
[108,1,100,100,"Vertrieb_4","Frankfurt am Main",4,"2021-04-20"]
[109,1,200,110,"Vertrieb_1","Hamburg",4,"2021-04-21"]
[110,1,250,120,"Vertrieb_2","München",4,"2021-04-22"]
[111,1,100,100,"Vertrieb_3","Köln",4,"2021-04-23"]
[112,1,200,110,"Vertrieb_4","Frankfurt am Main",4,"2021-04-24"]
[113,1,250,120,"Vertrieb_1","Hamburg",4,"2021-04-25"]
[114,1,100,100,"Vertrieb_2","München",4,"2021-04-26"]
[115,1,100,100,"Vertrieb_3","Köln",4,"2021-04-27"]
[116,1,200,110,"Vertrieb_4","Frankfurt am Main",4,"2021-04-28"]
[117,1,250,120,"Vertrieb_1","Hamburg",4,"2021-04-29"]
[118,1,100,100,"Vertrieb_2","München",4,"2021-04-30"]
[null,{"$f":"SUBTOTAL(9,B93:B122)","v":30},{"$f":"SUBTOTAL(9,C93:C122)","v":5400},null,null,null,"4 Ergebnis"]
[119,1,200,110,"Vertrieb_3","Köln",5,"2021-05-01"]
[120,1,250,120,"Vertrieb_4","Frankfurt am Main",5,"2021-05-02"]
[121,1,100,100,"Vertrieb_1","Hamburg",5,"2021-05-03"]
[122,1,200,110,"Vertrieb_2","München",5,"2021-05-04"]
[123,1,250,120,"Vertrieb_3","Köln",5,"2021-05-05"]
[124,1,100,100,"Vertrieb_4","Frankfurt am Main",5,"2021-05-06"]
[125,1,200,110,"Vertrieb_1","Hamburg",5,"2021-05-07"]
[126,1,250,120,"Vertrieb_2","München",5,"2021-05-08"]
[127,1,100,100,"Vertrieb_3","Köln",5,"2021-05-09"]
[128,1,200,110,"Vertrieb_4","Frankfurt am Main",5,"2021-05-10"]
[129,1,250,120,"Vertrieb_1","Hamburg",5,"2021-05-11"]
[130,1,100,100,"Vertrieb_2","München",5,"2021-05-12"]
[131,1,200,110,"Vertrieb_3","Köln",5,"2021-05-13"]
[132,1,250,120,"Vertrieb_4","Frankfurt am Main",5,"2021-05-14"]
[133,1,100,100,"Vertrieb_1","Hamburg",5,"2021-05-15"]
[134,1,200,110,"Vertrieb_2","München",5,"2021-05-16"]
[135,1,250,120,"Vertrieb_3","Köln",5,"2021-05-17"]
[136,1,100,100,"Vertrieb_4","Frankfurt am Main",5,"2021-05-18"]
[137,1,200,110,"Vertrieb_1","Hamburg",5,"2021-05-19"]
[138,1,250,120,"Vertrieb_2","München",5,"2021-05-20"]
[139,1,100,100,"Vertrieb_3","Köln",5,"2021-05-21"]
[140,1,200,110,"Vertrieb_4","Frankfurt am Main",5,"2021-05-22"]
[141,1,250,120,"Vertrieb_1","Hamburg",5,"2021-05-23"]
[142,1,100,100,"Vertrieb_2","München",5,"2021-05-24"]
[143,1,200,110,"Vertrieb_3","Köln",5,"2021-05-25"]
[144,1,250,120,"Vertrieb_4","Frankfurt am Main",5,"2021-05-26"]
[145,1,100,100,"Vertrieb_1","Hamburg",5,"2021-05-27"]
[146,1,250,120,"Vertrieb_2","München",5,"2021-05-28"]
[147,1,100,100,"Vertrieb_3","Köln",5,"2021-05-29"]
[148,1,200,110,"Vertrieb_4","Frankfurt am Main",5,"2021-05-30"]
[149,1,250,120,"Vertrieb_1","Hamburg",5,"2021-05-31"]
[null,{"$f":"SUBTOTAL(9,B124:B154)","v":31},{"$f":"SUBTOTAL(9,C124:C154)","v":5750},null,null,null,"5 Ergebnis"]
[150,1,100,100,"Vertrieb_2","München",6,"2021-06-01"]
[151,1,200,110,"Vertrieb_3","Köln",6,"2021-06-02"]
[152,1,250,120,"Vertrieb_4","Frankfurt am Main",6,"2021-06-03"]
[153,1,100,100,"Vertrieb_1","Hamburg",6,"2021-06-04"]
[154,1,200,110,"Vertrieb_2","München",6,"2021-06-05"]
[155,1,250,120,"Vertrieb_3","Köln",6,"2021-06-06"]
[156,1,100,100,"Vertrieb_4","Frankfurt am Main",6,"2021-06-07"]
[157,1,200,110,"Vertrieb_1","Hamburg",6,"2021-06-08"]
[158,1,250,120,"Vertrieb_2","München",6,"2021-06-09"]
[159,1,100,100,"Vertrieb_3","Köln",6,"2021-06-10"]
[160,1,200,110,"Vertrieb_4","Frankfurt am Main",6,"2021-06-11"]
[161,1,250,120,"Vertrieb_1","Hamburg",6,"2021-06-12"]
[162,1,100,100,"Vertrieb_2","München",6,"2021-06-13"]
[163,1,200,110,"Vertrieb_3","Köln",6,"2021-06-14"]
[164,1,250,120,"Vertrieb_4","Frankfurt am Main",6,"2021-06-15"]
[165,1,100,100,"Vertrieb_1","Hamburg",6,"2021-06-16"]
[166,1,200,110,"Vertrieb_2","München",6,"2021-06-17"]
[167,1,250,120,"Vertrieb_3","Köln",6,"2021-06-18"]
[168,1,100,100,"Vertrieb_4","Frankfurt am Main",6,"2021-06-19"]
[169,1,200,110,"Vertrieb_1","Hamburg",6,"2021-06-20"]
[170,1,250,120,"Vertrieb_2","München",6,"2021-06-21"]
[171,1,100,100,"Vertrieb_3","Köln",6,"2021-06-22"]
[172,1,200,110,"Vertrieb_4","Frankfurt am Main",6,"2021-06-23"]
[173,1,250,120,"Vertrieb_1","Hamburg",6,"2021-06-24"]
[174,1,100,100,"Vertrieb_2","München",6,"2021-06-25"]
[175,1,200,110,"Vertrieb_3","Köln",6,"2021-06-26"]
[176,1,250,120,"Vertrieb_4","Frankfurt am Main",6,"2021-06-27"]
[177,1,200,110,"Vertrieb_1","Hamburg",6,"2021-06-28"]
[178,1,250,120,"Vertrieb_2","München",6,"2021-06-29"]
[179,1,100,100,"Vertrieb_3","Köln",6,"2021-06-30"]
[null,{"$f":"SUBTOTAL(9,B156:B185)","v":30},{"$f":"SUBTOTAL(9,C156:C185)","v":5500},null,null,null,"6 Ergebnis"]
[180,1,200,110,"Vertrieb_4","Frankfurt am Main",7,"2021-07-01"]
[181,1,250,120,"Vertrieb_1","Hamburg",7,"2021-07-02"]
[182,1,100,100,"Vertrieb_2","München",7,"2021-07-03"]
[183,1,200,110,"Vertrieb_3","Köln",7,"2021-07-04"]
[184,1,250,120,"Vertrieb_4","Frankfurt am Main",7,"2021-07-05"]
[185,1,100,100,"Vertrieb_1","Hamburg",7,"2021-07-06"]
[186,1,200,110,"Vertrieb_2","München",7,"2021-07-07"]
[187,1,250,120,"Vertrieb_3","Köln",7,"2021-07-08"]
[188,1,100,100,"Vertrieb_4","Frankfurt am Main",7,"2021-07-09"]
[189,1,200,110,"Vertrieb_1","Hamburg",7,"2021-07-10"]
[190,1,250,120,"Vertrieb_2","München",7,"2021-07-11"]
[191,1,100,100,"Vertrieb_3","Köln",7,"2021-07-12"]
[192,1,200,110,"Vertrieb_4","Frankfurt am Main",7,"2021-07-13"]
[193,1,250,120,"Vertrieb_1","Hamburg",7,"2021-07-14"]
[194,1,100,100,"Vertrieb_2","München",7,"2021-07-15"]
[195,1,200,110,"Vertrieb_3","Köln",7,"2021-07-16"]
[196,1,250,120,"Vertrieb_4","Frankfurt am Main",7,"2021-07-17"]
[197,1,100,100,"Vertrieb_1","Hamburg",7,"2021-07-18"]
[198,1,200,110,"Vertrieb_2","München",7,"2021-07-19"]
[199,1,250,120,"Vertrieb_3","Köln",7,"2021-07-20"]
[200,1,100,100,"Vertrieb_4","Frankfurt am Main",7,"2021-07-21"]
[201,1,200,110,"Vertrieb_1","Hamburg",7,"2021-07-22"]
[202,1,250,120,"Vertrieb_2","München",7,"2021-07-23"]
[203,1,100,100,"Vertrieb_3","Köln",7,"2021-07-24"]
[204,1,200,110,"Vertrieb_4","Frankfurt am Main",7,"2021-07-25"]
[205,1,250,120,"Vertrieb_1","Hamburg",7,"2021-07-26"]
[206,1,100,100,"Vertrieb_2","München",7,"2021-07-27"]
[207,1,200,110,"Vertrieb_3","Köln",7,"2021-07-28"]
[208,1,100,100,"Vertrieb_4","Frankfurt am Main",7,"2021-07-29"]
[209,1,200,110,"Vertrieb_1","Hamburg",7,"2021-07-30"]
[210,1,250,120,"Vertrieb_2","München",7,"2021-07-31"]
[null,{"$f":"SUBTOTAL(9,B187:B217)","v":31},{"$f":"SUBTOTAL(9,C187:C217)","v":5700},null,null,null,"7 Ergebnis"]
[211,1,100,100,"Vertrieb_3","Köln",8,"2021-08-01"]
[212,1,200,110,"Vertrieb_4","Frankfurt am Main",8,"2021-08-02"]
[213,1,250,120,"Vertrieb_1","Hamburg",8,"2021-08-03"]
[214,1,100,100,"Vertrieb_2","München",8,"2021-08-04"]
[215,1,200,110,"Vertrieb_3","Köln",8,"2021-08-05"]
[216,1,250,120,"Vertrieb_4","Frankfurt am Main",8,"2021-08-06"]
[217,1,100,100,"Vertrieb_1","Hamburg",8,"2021-08-07"]
[218,1,200,110,"Vertrieb_2","München",8,"2021-08-08"]
[219,1,250,120,"Vertrieb_3","Köln",8,"2021-08-09"]
[220,1,100,100,"Vertrieb_4","Frankfurt am Main",8,"2021-08-10"]
[221,1,200,110,"Vertrieb_1","Hamburg",8,"2021-08-11"]
[222,1,250,120,"Vertrieb_2","München",8,"2021-08-12"]
[223,1,100,100,"Vertrieb_3","Köln",8,"2021-08-13"]
[224,1,200,110,"Vertrieb_4","Frankfurt am Main",8,"2021-08-14"]
[225,1,250,120,"Vertrieb_1","Hamburg",8,"2021-08-15"]
[226,1,100,100,"Vertrieb_2","München",8,"2021-08-16"]
[227,1,200,110,"Vertrieb_3","Köln",8,"2021-08-17"]
[228,1,250,120,"Vertrieb_4","Frankfurt am Main",8,"2021-08-18"]
[229,1,100,100,"Vertrieb_1","Hamburg",8,"2021-08-19"]
[230,1,200,110,"Vertrieb_2","München",8,"2021-08-20"]
[231,1,250,120,"Vertrieb_3","Köln",8,"2021-08-21"]
[232,1,100,100,"Vertrieb_4","Frankfurt am Main",8,"2021-08-22"]
[233,1,200,110,"Vertrieb_1","Hamburg",8,"2021-08-23"]
[234,1,250,120,"Vertrieb_2","München",8,"2021-08-24"]
[235,1,100,100,"Vertrieb_3","Köln",8,"2021-08-25"]
[236,1,200,110,"Vertrieb_4","Frankfurt am Main",8,"2021-08-26"]
[237,1,250,120,"Vertrieb_1","Hamburg",8,"2021-08-27"]
[238,1,100,100,"Vertrieb_2","München",8,"2021-08-28"]
[239,1,100,100,"Vertrieb_3","Köln",8,"2021-08-29"]
[240,1,200,110,"Vertrieb_4","Frankfurt am Main",8,"2021-08-30"]
[241,1,250,120,"Vertrieb_1","Hamburg",8,"2021-08-31"]
[null,{"$f":"SUBTOTAL(9,B219:B249)","v":31},{"$f":"SUBTOTAL(9,C219:C249)","v":5600},null,null,null,"8 Ergebnis"]
[242,1,100,100,"Vertrieb_2","München",9,"2021-09-01"]
[243,1,200,110,"Vertrieb_3","Köln",9,"2021-09-02"]
[244,1,250,120,"Vertrieb_4","Frankfurt am Main",9,"2021-09-03"]
[245,1,100,100,"Vertrieb_1","Hamburg",9,"2021-09-04"]
[246,1,200,110,"Vertrieb_2","München",9,"2021-09-05"]
[247,1,250,120,"Vertrieb_3","Köln",9,"2021-09-06"]
[248,1,100,100,"Vertrieb_4","Frankfurt am Main",9,"2021-09-07"]
[249,1,200,110,"Vertrieb_1","Hamburg",9,"2021-09-08"]
[250,1,250,120,"Vertrieb_2","München",9,"2021-09-09"]
[251,1,100,100,"Vertrieb_3","Köln",9,"2021-09-10"]
[252,1,200,110,"Vertrieb_4","Frankfurt am Main",9,"2021-09-11"]
[253,1,250,120,"Vertrieb_1","Hamburg",9,"2021-09-12"]
[254,1,100,100,"Vertrieb_2","München",9,"2021-09-13"]
[255,1,200,110,"Vertrieb_3","Köln",9,"2021-09-14"]
[256,1,250,120,"Vertrieb_4","Frankfurt am Main",9,"2021-09-15"]
[257,1,100,100,"Vertrieb_1","Hamburg",9,"2021-09-16"]
[258,1,200,110,"Vertrieb_2","München",9,"2021-09-17"]
[259,1,250,120,"Vertrieb_3","Köln",9,"2021-09-18"]
[260,1,100,100,"Vertrieb_4","Frankfurt am Main",9,"2021-09-19"]
[261,1,200,110,"Vertrieb_1","Hamburg",9,"2021-09-20"]
[262,1,250,120,"Vertrieb_2","München",9,"2021-09-21"]
[263,1,100,100,"Vertrieb_3","Köln",9,"2021-09-22"]
[264,1,200,110,"Vertrieb_4","Frankfurt am Main",9,"2021-09-23"]
[265,1,250,120,"Vertrieb_1","Hamburg",9,"2021-09-24"]
[266,1,100,100,"Vertrieb_2","München",9,"2021-09-25"]
[267,1,200,110,"Vertrieb_3","Köln",9,"2021-09-26"]
[268,1,250,120,"Vertrieb_4","Frankfurt am Main",9,"2021-09-27"]
[269,1,100,100,"Vertrieb_1","Hamburg",9,"2021-09-28"]
[270,1,250,120,"Vertrieb_2","München",9,"2021-09-29"]
[271,1,100,100,"Vertrieb_3","Köln",9,"2021-09-30"]
[null,{"$f":"SUBTOTAL(9,B251:B280)","v":30},{"$f":"SUBTOTAL(9,C251:C280)","v":5400},null,null,null,"9 Ergebnis"]
[272,1,200,110,"Vertrieb_4","Frankfurt am Main",10,"2021-10-01"]
[273,1,250,120,"Vertrieb_1","Hamburg",10,"2021-10-02"]
[274,1,100,100,"Vertrieb_2","München",10,"2021-10-03"]
[275,1,200,110,"Vertrieb_3","Köln",10,"2021-10-04"]
[276,1,250,120,"Vertrieb_4","Frankfurt am Main",10,"2021-10-05"]
[277,1,100,100,"Vertrieb_1","Hamburg",10,"2021-10-06"]
[278,1,200,110,"Vertrieb_2","München",10,"2021-10-07"]
[279,1,250,120,"Vertrieb_3","Köln",10,"2021-10-08"]
[280,1,100,100,"Vertrieb_4","Frankfurt am Main",10,"2021-10-09"]
[281,1,200,110,"Vertrieb_1","Hamburg",10,"2021-10-10"]
[282,1,250,120,"Vertrieb_2","München",10,"2021-10-11"]
[283,1,100,100,"Vertrieb_3","Köln",10,"2021-10-12"]
[284,1,200,110,"Vertrieb_4","Frankfurt am Main",10,"2021-10-13"]
[285,1,250,120,"Vertrieb_1","Hamburg",10,"2021-10-14"]
[286,1,100,100,"Vertrieb_2","München",10,"2021-10-15"]
[287,1,200,110,"Vertrieb_3","Köln",10,"2021-10-16"]
[288,1,250,120,"Vertrieb_4","Frankfurt am Main",10,"2021-10-17"]
[289,1,100,100,"Vertrieb_1","Hamburg",10,"2021-10-18"]
[290,1,200,110,"Vertrieb_2","München",10,"2021-10-19"]
[291,1,250,120,"Vertrieb_3","Köln",10,"2021-10-20"]
[292,1,100,100,"Vertrieb_4","Frankfurt am Main",10,"2021-10-21"]
[293,1,200,110,"Vertrieb_1","Hamburg",10,"2021-10-22"]
[294,1,250,120,"Vertrieb_2","München",10,"2021-10-23"]
[295,1,100,100,"Vertrieb_3","Köln",10,"2021-10-24"]
[296,1,200,110,"Vertrieb_4","Frankfurt am Main",10,"2021-10-25"]
[297,1,250,120,"Vertrieb_1","Hamburg",10,"2021-10-26"]
[298,1,100,100,"Vertrieb_2","München",10,"2021-10-27"]
[299,1,200,110,"Vertrieb_3","Köln",10,"2021-10-28"]
[300,1,250,120,"Vertrieb_4","Frankfurt am Main",10,"2021-10-29"]
[301,1,200,110,"Vertrieb_1","Hamburg",10,"2021-10-30"]
[302,1,250,120,"Vertrieb_2","München",10,"2021-10-31"]
[null,{"$f":"SUBTOTAL(9,B282:B312)","v":31},{"$f":"SUBTOTAL(9,C282:C312)","v":5850},null,null,null,"10 Ergebnis"]
[303,1,100,100,"Vertrieb_3","Köln",11,"2021-11-01"]
[304,1,200,110,"Vertrieb_4","Frankfurt am Main",11,"2021-11-02"]
[305,1,250,120,"Vertrieb_1","Hamburg",11,"2021-11-03"]
[306,1,100,100,"Vertrieb_2","München",11,"2021-11-04"]
[307,1,200,110,"Vertrieb_3","Köln",11,"2021-11-05"]
[308,1,250,120,"Vertrieb_4","Frankfurt am Main",11,"2021-11-06"]
[309,1,100,100,"Vertrieb_1","Hamburg",11,"2021-11-07"]
[310,1,200,110,"Vertrieb_2","München",11,"2021-11-08"]
[311,1,250,120,"Vertrieb_3","Köln",11,"2021-11-09"]
[312,1,100,100,"Vertrieb_4","Frankfurt am Main",11,"2021-11-10"]
[313,1,200,110,"Vertrieb_1","Hamburg",11,"2021-11-11"]
[314,1,250,120,"Vertrieb_2","München",11,"2021-11-12"]
[315,1,100,100,"Vertrieb_3","Köln",11,"2021-11-13"]
[316,1,200,110,"Vertrieb_4","Frankfurt am Main",11,"2021-11-14"]
[317,1,250,120,"Vertrieb_1","Hamburg",11,"2021-11-15"]
[318,1,100,100,"Vertrieb_2","München",11,"2021-11-16"]
[319,1,200,110,"Vertrieb_3","Köln",11,"2021-11-17"]
[320,1,250,120,"Vertrieb_4","Frankfurt am Main",11,"2021-11-18"]
[321,1,100,100,"Vertrieb_1","Hamburg",11,"2021-11-19"]
[322,1,200,110,"Vertrieb_2","München",11,"2021-11-20"]
[323,1,250,120,"Vertrieb_3","Köln",11,"2021-11-21"]
[324,1,100,100,"Vertrieb_4","Frankfurt am Main",11,"2021-11-22"]
[325,1,200,110,"Vertrieb_1","Hamburg",11,"2021-11-23"]
[326,1,250,120,"Vertrieb_2","München",11,"2021-11-24"]
[327,1,100,100,"Vertrieb_3","Köln",11,"2021-11-25"]
[328,1,200,110,"Vertrieb_4","Frankfurt am Main",11,"2021-11-26"]
[329,1,250,120,"Vertrieb_1","Hamburg",11,"2021-11-27"]
[330,1,100,100,"Vertrieb_2","München",11,"2021-11-28"]
[331,1,200,110,"Vertrieb_3","Köln",11,"2021-11-29"]
[332,1,100,100,"Vertrieb_4","Frankfurt am Main",11,"2021-11-30"]
[null,{"$f":"SUBTOTAL(9,B314:B343)","v":30},{"$f":"SUBTOTAL(9,C314:C343)","v":5350},null,null,null,"11 Ergebnis"]
[333,1,200,110,"Vertrieb_1","Hamburg",12,"2021-12-01"]
[334,1,250,120,"Vertrieb_2","München",12,"2021-12-02"]
[335,1,100,100,"Vertrieb_3","Köln",12,"2021-12-03"]
[336,1,200,110,"Vertrieb_4","Frankfurt am Main",12,"2021-12-04"]
[337,1,250,120,"Vertrieb_1","Hamburg",12,"2021-12-05"]
[338,1,100,100,"Vertrieb_2","München",12,"2021-12-06"]
[339,1,200,110,"Vertrieb_3","Köln",12,"2021-12-07"]
[340,1,250,120,"Vertrieb_4","Frankfurt am Main",12,"2021-12-08"]
[341,1,100,100,"Vertrieb_1","Hamburg",12,"2021-12-09"]
[342,1,200,110,"Vertrieb_2","München",12,"2021-12-10"]
[343,1,250,120,"Vertrieb_3","Köln",12,"2021-12-11"]
[344,1,100,100,"Vertrieb_4","Frankfurt am Main",12,"2021-12-12"]
[345,1,200,110,"Vertrieb_1","Hamburg",12,"2021-12-13"]
[346,1,250,120,"Vertrieb_2","München",12,"2021-12-14"]
[347,1,100,100,"Vertrieb_3","Köln",12,"2021-12-15"]
[348,1,200,110,"Vertrieb_4","Frankfurt am Main",12,"2021-12-16"]
[349,1,250,120,"Vertrieb_1","Hamburg",12,"2021-12-17"]
[350,1,100,100,"Vertrieb_2","München",12,"2021-12-18"]
[351,1,200,110,"Vertrieb_3","Köln",12,"2021-12-19"]
[352,1,250,120,"Vertrieb_4","Frankfurt am Main",12,"2021-12-20"]
[353,1,100,100,"Vertrieb_1","Hamburg",12,"2021-12-21"]
[354,1,200,110,"Vertrieb_2","München",12,"2021-12-22"]
[355,1,250,120,"Vertrieb_3","Köln",12,"2021-12-23"]
[356,1,100,100,"Vertrieb_4","Frankfurt am Main",12,"2021-12-24"]
[357,1,200,110,"Vertrieb_1","Hamburg",12,"2021-12-25"]
[358,1,250,120,"Vertrieb_2","München",12,"2021-12-26"]
[359,1,100,100,"Vertrieb_3","Köln",12,"2021-12-27"]
[360,1,200,110,"Vertrieb_4","Frankfurt am Main",12,"2021-12-28"]
[361,1,250,120,"Vertrieb_1","Hamburg",12,"2021-12-29"]
[362,1,100,100,"Vertrieb_2","München",12,"2021-12-30"]
[363,1,100,100,"Vertrieb_3","Köln",12,"2021-12-31"]
[null,{"$f":"SUBTOTAL(9,B345:B375)","v":31},{"$f":"SUBTOTAL(9,C345:C375)","v":5600},null,null,null,"12 Ergebnis"]
[null,{"$f":"SUBTOTAL(9,B2:B375)","v":363},{"$f":"SUBTOTAL(9,C2:C375)","v":66300},null,null,null,"Gesamtergebnis"]

{"sheet":"Summewenns","index":16,"n_rows":364,"n_cols":14,"rows_kept":364,"cut":false,"hidden":false,"merged":[]}
["lfd. Nr.","Anzahl","Umsatz","Produkt","Vertrieb","Ort","Monat","Datum",null,"Vertrieb",100,110,120,"Summe"]
[1,1,100,100,"Vertrieb_1","Hamburg",1,"2021-01-03",null,"Vertrieb_1",{"$f":"SUMIFS($C:$C,$E:$E,$J2,$D:$D,K$1)","v":2600},{"$f":"SUMIFS($C:$C,$E:$E,$J2,$D:$D,L$1)","v":6200},8500,{"$f":"SUM(K2:M2)","v":17300}]
[2,1,200,110,"Vertrieb_2","München",1,"2021-01-04",null,"Vertrieb_2",{"$f":"SUMIFS($C:$C,$E:$E,$J3,$D:$D,K$1)","v":3400},4800,8250,{"$f":"SUM(K3:M3)","v":16450}]
[3,1,250,120,"Vertrieb_3","Köln",1,"2021-01-05",null,"Vertrieb_3",3500,6200,6250,15950]
[4,1,100,100,"Vertrieb_4","Frankfurt am Main",1,"2021-01-06",null,"Vertrieb_4",2800,6800,7000,16600]
[5,1,200,110,"Vertrieb_1","Hamburg",1,"2021-01-07",null,null,{"$f":"SUM(K2:K5)","v":12300},24000,30000,{"$f":"SUM(N2:N5)","v":66300}]
[6,1,200,110,"Vertrieb_2","München",1,"2021-01-08"]
[7,1,250,120,"Vertrieb_3","Köln",1,"2021-01-09"]
[8,1,100,100,"Vertrieb_4","Frankfurt am Main",1,"2021-01-10",null,"im Vergleich dazu mit Pivot:"]
[9,1,200,110,"Vertrieb_1","Hamburg",1,"2021-01-11",null,"Summe von Umsatz","Spaltenbeschriftungen"]
[10,1,250,120,"Vertrieb_2","München",1,"2021-01-12",null,"Zeilenbeschriftungen",100,110,120,"Gesamtergebnis"]
[11,1,250,120,"Vertrieb_3","Köln",1,"2021-01-13",null,"Vertrieb_1",2600,6200,8500,17300]
[12,1,100,100,"Vertrieb_4","Frankfurt am Main",1,"2021-01-14",null,"Vertrieb_2",3400,4800,8250,16450]
[13,1,200,110,"Vertrieb_1","Hamburg",1,"2021-01-15",null,"Vertrieb_3",3500,6200,6250,15950]
[14,1,250,120,"Vertrieb_2","München",1,"2021-01-16",null,"Vertrieb_4",2800,6800,7000,16600]
[15,1,100,100,"Vertrieb_3","Köln",1,"2021-01-17",null,"Gesamtergebnis",12300,24000,30000,66300]
[16,1,200,110,"Vertrieb_4","Frankfurt am Main",1,"2021-01-18"]
[17,1,250,120,"Vertrieb_1","Hamburg",1,"2021-01-19"]
[18,1,100,100,"Vertrieb_2","München",1,"2021-01-20"]
[19,1,200,110,"Vertrieb_3","Köln",1,"2021-01-21"]
[20,1,250,120,"Vertrieb_4","Frankfurt am Main",1,"2021-01-22"]
[21,1,100,100,"Vertrieb_1","Hamburg",1,"2021-01-23"]
[22,1,250,120,"Vertrieb_2","München",1,"2021-01-24"]
[23,1,100,100,"Vertrieb_3","Köln",1,"2021-01-25"]
[24,1,200,110,"Vertrieb_4","Frankfurt am Main",1,"2021-01-26"]
[25,1,250,120,"Vertrieb_1","Hamburg",1,"2021-01-27"]
[26,1,100,100,"Vertrieb_2","München",1,"2021-01-28"]
[27,1,200,110,"Vertrieb_3","Köln",1,"2021-01-29"]
[28,1,250,120,"Vertrieb_4","Frankfurt am Main",1,"2021-01-30"]
[29,1,100,100,"Vertrieb_1","Hamburg",1,"2021-01-31"]
[30,1,200,110,"Vertrieb_2","München",2,"2021-02-01"]
[31,1,250,120,"Vertrieb_3","Köln",2,"2021-02-02"]
[32,1,100,100,"Vertrieb_4","Frankfurt am Main",2,"2021-02-03"]
[33,1,200,110,"Vertrieb_1","Hamburg",2,"2021-02-04"]
[34,1,250,120,"Vertrieb_2","München",2,"2021-02-05"]
[35,1,100,100,"Vertrieb_3","Köln",2,"2021-02-06"]
[36,1,200,110,"Vertrieb_4","Frankfurt am Main",2,"2021-02-07"]
[37,1,250,120,"Vertrieb_1","Hamburg",2,"2021-02-08"]
[38,1,100,100,"Vertrieb_2","München",2,"2021-02-09"]
[39,1,200,110,"Vertrieb_3","Köln",2,"2021-02-10"]
[40,1,250,120,"Vertrieb_4","Frankfurt am Main",2,"2021-02-11"]
[41,1,100,100,"Vertrieb_1","Hamburg",2,"2021-02-12"]
[42,1,200,110,"Vertrieb_2","München",2,"2021-02-13"]
[43,1,250,120,"Vertrieb_3","Köln",2,"2021-02-14"]
[44,1,100,100,"Vertrieb_4","Frankfurt am Main",2,"2021-02-15"]
[45,1,200,110,"Vertrieb_1","Hamburg",2,"2021-02-16"]
[46,1,250,120,"Vertrieb_2","München",2,"2021-02-17"]
[47,1,100,100,"Vertrieb_3","Köln",2,"2021-02-18"]
[48,1,200,110,"Vertrieb_4","Frankfurt am Main",2,"2021-02-19"]
[49,1,250,120,"Vertrieb_1","Hamburg",2,"2021-02-20"]
[50,1,100,100,"Vertrieb_2","München",2,"2021-02-21"]
[51,1,200,110,"Vertrieb_3","Köln",2,"2021-02-22"]
[52,1,250,120,"Vertrieb_4","Frankfurt am Main",2,"2021-02-23"]
[53,1,200,110,"Vertrieb_1","Hamburg",2,"2021-02-24"]
[54,1,250,120,"Vertrieb_2","München",2,"2021-02-25"]
[55,1,100,100,"Vertrieb_3","Köln",2,"2021-02-26"]
[56,1,200,110,"Vertrieb_4","Frankfurt am Main",2,"2021-02-27"]
[57,1,250,120,"Vertrieb_1","Hamburg",2,"2021-02-28"]
[58,1,100,100,"Vertrieb_2","München",3,"2021-03-01"]
[59,1,200,110,"Vertrieb_3","Köln",3,"2021-03-02"]
[60,1,250,120,"Vertrieb_4","Frankfurt am Main",3,"2021-03-03"]
[61,1,100,100,"Vertrieb_1","Hamburg",3,"2021-03-04"]
[62,1,200,110,"Vertrieb_2","München",3,"2021-03-05"]
[63,1,250,120,"Vertrieb_3","Köln",3,"2021-03-06"]
[64,1,100,100,"Vertrieb_4","Frankfurt am Main",3,"2021-03-07"]
[65,1,200,110,"Vertrieb_1","Hamburg",3,"2021-03-08"]
[66,1,250,120,"Vertrieb_2","München",3,"2021-03-09"]
[67,1,100,100,"Vertrieb_3","Köln",3,"2021-03-10"]
[68,1,200,110,"Vertrieb_4","Frankfurt am Main",3,"2021-03-11"]
[69,1,250,120,"Vertrieb_1","Hamburg",3,"2021-03-12"]
[70,1,100,100,"Vertrieb_2","München",3,"2021-03-13"]
[71,1,200,110,"Vertrieb_3","Köln",3,"2021-03-14"]
[72,1,250,120,"Vertrieb_4","Frankfurt am Main",3,"2021-03-15"]
[73,1,100,100,"Vertrieb_1","Hamburg",3,"2021-03-16"]
[74,1,200,110,"Vertrieb_2","München",3,"2021-03-17"]
[75,1,250,120,"Vertrieb_3","Köln",3,"2021-03-18"]
[76,1,100,100,"Vertrieb_4","Frankfurt am Main",3,"2021-03-19"]
[77,1,200,110,"Vertrieb_1","Hamburg",3,"2021-03-20"]
[78,1,250,120,"Vertrieb_2","München",3,"2021-03-21"]
[79,1,100,100,"Vertrieb_3","Köln",3,"2021-03-22"]
[80,1,200,110,"Vertrieb_4","Frankfurt am Main",3,"2021-03-23"]
[81,1,250,120,"Vertrieb_1","Hamburg",3,"2021-03-24"]
[82,1,100,100,"Vertrieb_2","München",3,"2021-03-25"]
[83,1,200,110,"Vertrieb_3","Köln",3,"2021-03-26"]
[84,1,100,100,"Vertrieb_4","Frankfurt am Main",3,"2021-03-27"]
[85,1,200,110,"Vertrieb_1","Hamburg",3,"2021-03-28"]
[86,1,250,120,"Vertrieb_2","München",3,"2021-03-29"]
[87,1,100,100,"Vertrieb_3","Köln",3,"2021-03-30"]
[88,1,200,110,"Vertrieb_4","Frankfurt am Main",3,"2021-03-31"]
[89,1,250,120,"Vertrieb_1","Hamburg",4,"2021-04-01"]
[90,1,100,100,"Vertrieb_2","München",4,"2021-04-02"]
[91,1,200,110,"Vertrieb_3","Köln",4,"2021-04-03"]
[92,1,250,120,"Vertrieb_4","Frankfurt am Main",4,"2021-04-04"]
[93,1,100,100,"Vertrieb_1","Hamburg",4,"2021-04-05"]
[94,1,200,110,"Vertrieb_2","München",4,"2021-04-06"]
[95,1,250,120,"Vertrieb_3","Köln",4,"2021-04-07"]
[96,1,100,100,"Vertrieb_4","Frankfurt am Main",4,"2021-04-08"]
[97,1,200,110,"Vertrieb_1","Hamburg",4,"2021-04-09"]
[98,1,250,120,"Vertrieb_2","München",4,"2021-04-10"]
[99,1,100,100,"Vertrieb_3","Köln",4,"2021-04-11"]
[100,1,200,110,"Vertrieb_4","Frankfurt am Main",4,"2021-04-12"]
[101,1,250,120,"Vertrieb_1","Hamburg",4,"2021-04-13"]
[102,1,100,100,"Vertrieb_2","München",4,"2021-04-14"]
[103,1,200,110,"Vertrieb_3","Köln",4,"2021-04-15"]
[104,1,250,120,"Vertrieb_4","Frankfurt am Main",4,"2021-04-16"]
[105,1,100,100,"Vertrieb_1","Hamburg",4,"2021-04-17"]
[106,1,200,110,"Vertrieb_2","München",4,"2021-04-18"]
[107,1,250,120,"Vertrieb_3","Köln",4,"2021-04-19"]
[108,1,100,100,"Vertrieb_4","Frankfurt am Main",4,"2021-04-20"]
[109,1,200,110,"Vertrieb_1","Hamburg",4,"2021-04-21"]
[110,1,250,120,"Vertrieb_2","München",4,"2021-04-22"]
[111,1,100,100,"Vertrieb_3","Köln",4,"2021-04-23"]
[112,1,200,110,"Vertrieb_4","Frankfurt am Main",4,"2021-04-24"]
[113,1,250,120,"Vertrieb_1","Hamburg",4,"2021-04-25"]
[114,1,100,100,"Vertrieb_2","München",4,"2021-04-26"]
[115,1,100,100,"Vertrieb_3","Köln",4,"2021-04-27"]
[116,1,200,110,"Vertrieb_4","Frankfurt am Main",4,"2021-04-28"]
[117,1,250,120,"Vertrieb_1","Hamburg",4,"2021-04-29"]
[118,1,100,100,"Vertrieb_2","München",4,"2021-04-30"]
[119,1,200,110,"Vertrieb_3","Köln",5,"2021-05-01"]
[120,1,250,120,"Vertrieb_4","Frankfurt am Main",5,"2021-05-02"]
[121,1,100,100,"Vertrieb_1","Hamburg",5,"2021-05-03"]
[122,1,200,110,"Vertrieb_2","München",5,"2021-05-04"]
[123,1,250,120,"Vertrieb_3","Köln",5,"2021-05-05"]
[124,1,100,100,"Vertrieb_4","Frankfurt am Main",5,"2021-05-06"]
[125,1,200,110,"Vertrieb_1","Hamburg",5,"2021-05-07"]
[126,1,250,120,"Vertrieb_2","München",5,"2021-05-08"]
[127,1,100,100,"Vertrieb_3","Köln",5,"2021-05-09"]
[128,1,200,110,"Vertrieb_4","Frankfurt am Main",5,"2021-05-10"]
[129,1,250,120,"Vertrieb_1","Hamburg",5,"2021-05-11"]
[130,1,100,100,"Vertrieb_2","München",5,"2021-05-12"]
[131,1,200,110,"Vertrieb_3","Köln",5,"2021-05-13"]
[132,1,250,120,"Vertrieb_4","Frankfurt am Main",5,"2021-05-14"]
[133,1,100,100,"Vertrieb_1","Hamburg",5,"2021-05-15"]
[134,1,200,110,"Vertrieb_2","München",5,"2021-05-16"]
[135,1,250,120,"Vertrieb_3","Köln",5,"2021-05-17"]
[136,1,100,100,"Vertrieb_4","Frankfurt am Main",5,"2021-05-18"]
[137,1,200,110,"Vertrieb_1","Hamburg",5,"2021-05-19"]
[138,1,250,120,"Vertrieb_2","München",5,"2021-05-20"]
[139,1,100,100,"Vertrieb_3","Köln",5,"2021-05-21"]
[140,1,200,110,"Vertrieb_4","Frankfurt am Main",5,"2021-05-22"]
[141,1,250,120,"Vertrieb_1","Hamburg",5,"2021-05-23"]
[142,1,100,100,"Vertrieb_2","München",5,"2021-05-24"]
[143,1,200,110,"Vertrieb_3","Köln",5,"2021-05-25"]
[144,1,250,120,"Vertrieb_4","Frankfurt am Main",5,"2021-05-26"]
[145,1,100,100,"Vertrieb_1","Hamburg",5,"2021-05-27"]
[146,1,250,120,"Vertrieb_2","München",5,"2021-05-28"]
[147,1,100,100,"Vertrieb_3","Köln",5,"2021-05-29"]
[148,1,200,110,"Vertrieb_4","Frankfurt am Main",5,"2021-05-30"]
[149,1,250,120,"Vertrieb_1","Hamburg",5,"2021-05-31"]
[150,1,100,100,"Vertrieb_2","München",6,"2021-06-01"]
[151,1,200,110,"Vertrieb_3","Köln",6,"2021-06-02"]
[152,1,250,120,"Vertrieb_4","Frankfurt am Main",6,"2021-06-03"]
[153,1,100,100,"Vertrieb_1","Hamburg",6,"2021-06-04"]
[154,1,200,110,"Vertrieb_2","München",6,"2021-06-05"]
[155,1,250,120,"Vertrieb_3","Köln",6,"2021-06-06"]
[156,1,100,100,"Vertrieb_4","Frankfurt am Main",6,"2021-06-07"]
[157,1,200,110,"Vertrieb_1","Hamburg",6,"2021-06-08"]
[158,1,250,120,"Vertrieb_2","München",6,"2021-06-09"]
[159,1,100,100,"Vertrieb_3","Köln",6,"2021-06-10"]
[160,1,200,110,"Vertrieb_4","Frankfurt am Main",6,"2021-06-11"]
[161,1,250,120,"Vertrieb_1","Hamburg",6,"2021-06-12"]
[162,1,100,100,"Vertrieb_2","München",6,"2021-06-13"]
[163,1,200,110,"Vertrieb_3","Köln",6,"2021-06-14"]
[164,1,250,120,"Vertrieb_4","Frankfurt am Main",6,"2021-06-15"]
[165,1,100,100,"Vertrieb_1","Hamburg",6,"2021-06-16"]
[166,1,200,110,"Vertrieb_2","München",6,"2021-06-17"]
[167,1,250,120,"Vertrieb_3","Köln",6,"2021-06-18"]
[168,1,100,100,"Vertrieb_4","Frankfurt am Main",6,"2021-06-19"]
[169,1,200,110,"Vertrieb_1","Hamburg",6,"2021-06-20"]
[170,1,250,120,"Vertrieb_2","München",6,"2021-06-21"]
[171,1,100,100,"Vertrieb_3","Köln",6,"2021-06-22"]
[172,1,200,110,"Vertrieb_4","Frankfurt am Main",6,"2021-06-23"]
[173,1,250,120,"Vertrieb_1","Hamburg",6,"2021-06-24"]
[174,1,100,100,"Vertrieb_2","München",6,"2021-06-25"]
[175,1,200,110,"Vertrieb_3","Köln",6,"2021-06-26"]
[176,1,250,120,"Vertrieb_4","Frankfurt am Main",6,"2021-06-27"]
[177,1,200,110,"Vertrieb_1","Hamburg",6,"2021-06-28"]
[178,1,250,120,"Vertrieb_2","München",6,"2021-06-29"]
[179,1,100,100,"Vertrieb_3","Köln",6,"2021-06-30"]
[180,1,200,110,"Vertrieb_4","Frankfurt am Main",7,"2021-07-01"]
[181,1,250,120,"Vertrieb_1","Hamburg",7,"2021-07-02"]
[182,1,100,100,"Vertrieb_2","München",7,"2021-07-03"]
[183,1,200,110,"Vertrieb_3","Köln",7,"2021-07-04"]
[184,1,250,120,"Vertrieb_4","Frankfurt am Main",7,"2021-07-05"]
[185,1,100,100,"Vertrieb_1","Hamburg",7,"2021-07-06"]
[186,1,200,110,"Vertrieb_2","München",7,"2021-07-07"]
[187,1,250,120,"Vertrieb_3","Köln",7,"2021-07-08"]
[188,1,100,100,"Vertrieb_4","Frankfurt am Main",7,"2021-07-09"]
[189,1,200,110,"Vertrieb_1","Hamburg",7,"2021-07-10"]
[190,1,250,120,"Vertrieb_2","München",7,"2021-07-11"]
[191,1,100,100,"Vertrieb_3","Köln",7,"2021-07-12"]
[192,1,200,110,"Vertrieb_4","Frankfurt am Main",7,"2021-07-13"]
[193,1,250,120,"Vertrieb_1","Hamburg",7,"2021-07-14"]
[194,1,100,100,"Vertrieb_2","München",7,"2021-07-15"]
[195,1,200,110,"Vertrieb_3","Köln",7,"2021-07-16"]
[196,1,250,120,"Vertrieb_4","Frankfurt am Main",7,"2021-07-17"]
[197,1,100,100,"Vertrieb_1","Hamburg",7,"2021-07-18"]
[198,1,200,110,"Vertrieb_2","München",7,"2021-07-19"]
[199,1,250,120,"Vertrieb_3","Köln",7,"2021-07-20"]
[200,1,100,100,"Vertrieb_4","Frankfurt am Main",7,"2021-07-21"]
[201,1,200,110,"Vertrieb_1","Hamburg",7,"2021-07-22"]
[202,1,250,120,"Vertrieb_2","München",7,"2021-07-23"]
[203,1,100,100,"Vertrieb_3","Köln",7,"2021-07-24"]
[204,1,200,110,"Vertrieb_4","Frankfurt am Main",7,"2021-07-25"]
[205,1,250,120,"Vertrieb_1","Hamburg",7,"2021-07-26"]
[206,1,100,100,"Vertrieb_2","München",7,"2021-07-27"]
[207,1,200,110,"Vertrieb_3","Köln",7,"2021-07-28"]
[208,1,100,100,"Vertrieb_4","Frankfurt am Main",7,"2021-07-29"]
[209,1,200,110,"Vertrieb_1","Hamburg",7,"2021-07-30"]
[210,1,250,120,"Vertrieb_2","München",7,"2021-07-31"]
[211,1,100,100,"Vertrieb_3","Köln",8,"2021-08-01"]
[212,1,200,110,"Vertrieb_4","Frankfurt am Main",8,"2021-08-02"]
[213,1,250,120,"Vertrieb_1","Hamburg",8,"2021-08-03"]
[214,1,100,100,"Vertrieb_2","München",8,"2021-08-04"]
[215,1,200,110,"Vertrieb_3","Köln",8,"2021-08-05"]
[216,1,250,120,"Vertrieb_4","Frankfurt am Main",8,"2021-08-06"]
[217,1,100,100,"Vertrieb_1","Hamburg",8,"2021-08-07"]
[218,1,200,110,"Vertrieb_2","München",8,"2021-08-08"]
[219,1,250,120,"Vertrieb_3","Köln",8,"2021-08-09"]
[220,1,100,100,"Vertrieb_4","Frankfurt am Main",8,"2021-08-10"]
[221,1,200,110,"Vertrieb_1","Hamburg",8,"2021-08-11"]
[222,1,250,120,"Vertrieb_2","München",8,"2021-08-12"]
[223,1,100,100,"Vertrieb_3","Köln",8,"2021-08-13"]
[224,1,200,110,"Vertrieb_4","Frankfurt am Main",8,"2021-08-14"]
[225,1,250,120,"Vertrieb_1","Hamburg",8,"2021-08-15"]
[226,1,100,100,"Vertrieb_2","München",8,"2021-08-16"]
[227,1,200,110,"Vertrieb_3","Köln",8,"2021-08-17"]
[228,1,250,120,"Vertrieb_4","Frankfurt am Main",8,"2021-08-18"]
[229,1,100,100,"Vertrieb_1","Hamburg",8,"2021-08-19"]
[230,1,200,110,"Vertrieb_2","München",8,"2021-08-20"]
[231,1,250,120,"Vertrieb_3","Köln",8,"2021-08-21"]
[232,1,100,100,"Vertrieb_4","Frankfurt am Main",8,"2021-08-22"]
[233,1,200,110,"Vertrieb_1","Hamburg",8,"2021-08-23"]
[234,1,250,120,"Vertrieb_2","München",8,"2021-08-24"]
[235,1,100,100,"Vertrieb_3","Köln",8,"2021-08-25"]
[236,1,200,110,"Vertrieb_4","Frankfurt am Main",8,"2021-08-26"]
[237,1,250,120,"Vertrieb_1","Hamburg",8,"2021-08-27"]
[238,1,100,100,"Vertrieb_2","München",8,"2021-08-28"]
[239,1,100,100,"Vertrieb_3","Köln",8,"2021-08-29"]
[240,1,200,110,"Vertrieb_4","Frankfurt am Main",8,"2021-08-30"]
[241,1,250,120,"Vertrieb_1","Hamburg",8,"2021-08-31"]
[242,1,100,100,"Vertrieb_2","München",9,"2021-09-01"]
[243,1,200,110,"Vertrieb_3","Köln",9,"2021-09-02"]
[244,1,250,120,"Vertrieb_4","Frankfurt am Main",9,"2021-09-03"]
[245,1,100,100,"Vertrieb_1","Hamburg",9,"2021-09-04"]
[246,1,200,110,"Vertrieb_2","München",9,"2021-09-05"]
[247,1,250,120,"Vertrieb_3","Köln",9,"2021-09-06"]
[248,1,100,100,"Vertrieb_4","Frankfurt am Main",9,"2021-09-07"]
[249,1,200,110,"Vertrieb_1","Hamburg",9,"2021-09-08"]
[250,1,250,120,"Vertrieb_2","München",9,"2021-09-09"]
[251,1,100,100,"Vertrieb_3","Köln",9,"2021-09-10"]
[252,1,200,110,"Vertrieb_4","Frankfurt am Main",9,"2021-09-11"]
[253,1,250,120,"Vertrieb_1","Hamburg",9,"2021-09-12"]
[254,1,100,100,"Vertrieb_2","München",9,"2021-09-13"]
[255,1,200,110,"Vertrieb_3","Köln",9,"2021-09-14"]
[256,1,250,120,"Vertrieb_4","Frankfurt am Main",9,"2021-09-15"]
[257,1,100,100,"Vertrieb_1","Hamburg",9,"2021-09-16"]
[258,1,200,110,"Vertrieb_2","München",9,"2021-09-17"]
[259,1,250,120,"Vertrieb_3","Köln",9,"2021-09-18"]
[260,1,100,100,"Vertrieb_4","Frankfurt am Main",9,"2021-09-19"]
[261,1,200,110,"Vertrieb_1","Hamburg",9,"2021-09-20"]
[262,1,250,120,"Vertrieb_2","München",9,"2021-09-21"]
[263,1,100,100,"Vertrieb_3","Köln",9,"2021-09-22"]
[264,1,200,110,"Vertrieb_4","Frankfurt am Main",9,"2021-09-23"]
[265,1,250,120,"Vertrieb_1","Hamburg",9,"2021-09-24"]
[266,1,100,100,"Vertrieb_2","München",9,"2021-09-25"]
[267,1,200,110,"Vertrieb_3","Köln",9,"2021-09-26"]
[268,1,250,120,"Vertrieb_4","Frankfurt am Main",9,"2021-09-27"]
[269,1,100,100,"Vertrieb_1","Hamburg",9,"2021-09-28"]
[270,1,250,120,"Vertrieb_2","München",9,"2021-09-29"]
[271,1,100,100,"Vertrieb_3","Köln",9,"2021-09-30"]
[272,1,200,110,"Vertrieb_4","Frankfurt am Main",10,"2021-10-01"]
[273,1,250,120,"Vertrieb_1","Hamburg",10,"2021-10-02"]
[274,1,100,100,"Vertrieb_2","München",10,"2021-10-03"]
[275,1,200,110,"Vertrieb_3","Köln",10,"2021-10-04"]
[276,1,250,120,"Vertrieb_4","Frankfurt am Main",10,"2021-10-05"]
[277,1,100,100,"Vertrieb_1","Hamburg",10,"2021-10-06"]
[278,1,200,110,"Vertrieb_2","München",10,"2021-10-07"]
[279,1,250,120,"Vertrieb_3","Köln",10,"2021-10-08"]
[280,1,100,100,"Vertrieb_4","Frankfurt am Main",10,"2021-10-09"]
[281,1,200,110,"Vertrieb_1","Hamburg",10,"2021-10-10"]
[282,1,250,120,"Vertrieb_2","München",10,"2021-10-11"]
[283,1,100,100,"Vertrieb_3","Köln",10,"2021-10-12"]
[284,1,200,110,"Vertrieb_4","Frankfurt am Main",10,"2021-10-13"]
[285,1,250,120,"Vertrieb_1","Hamburg",10,"2021-10-14"]
[286,1,100,100,"Vertrieb_2","München",10,"2021-10-15"]
[287,1,200,110,"Vertrieb_3","Köln",10,"2021-10-16"]
[288,1,250,120,"Vertrieb_4","Frankfurt am Main",10,"2021-10-17"]
[289,1,100,100,"Vertrieb_1","Hamburg",10,"2021-10-18"]
[290,1,200,110,"Vertrieb_2","München",10,"2021-10-19"]
[291,1,250,120,"Vertrieb_3","Köln",10,"2021-10-20"]
[292,1,100,100,"Vertrieb_4","Frankfurt am Main",10,"2021-10-21"]
[293,1,200,110,"Vertrieb_1","Hamburg",10,"2021-10-22"]
[294,1,250,120,"Vertrieb_2","München",10,"2021-10-23"]
[295,1,100,100,"Vertrieb_3","Köln",10,"2021-10-24"]
[296,1,200,110,"Vertrieb_4","Frankfurt am Main",10,"2021-10-25"]
[297,1,250,120,"Vertrieb_1","Hamburg",10,"2021-10-26"]
[298,1,100,100,"Vertrieb_2","München",10,"2021-10-27"]
[299,1,200,110,"Vertrieb_3","Köln",10,"2021-10-28"]
[300,1,250,120,"Vertrieb_4","Frankfurt am Main",10,"2021-10-29"]
[301,1,200,110,"Vertrieb_1","Hamburg",10,"2021-10-30"]
[302,1,250,120,"Vertrieb_2","München",10,"2021-10-31"]
[303,1,100,100,"Vertrieb_3","Köln",11,"2021-11-01"]
[304,1,200,110,"Vertrieb_4","Frankfurt am Main",11,"2021-11-02"]
[305,1,250,120,"Vertrieb_1","Hamburg",11,"2021-11-03"]
[306,1,100,100,"Vertrieb_2","München",11,"2021-11-04"]
[307,1,200,110,"Vertrieb_3","Köln",11,"2021-11-05"]
[308,1,250,120,"Vertrieb_4","Frankfurt am Main",11,"2021-11-06"]
[309,1,100,100,"Vertrieb_1","Hamburg",11,"2021-11-07"]
[310,1,200,110,"Vertrieb_2","München",11,"2021-11-08"]
[311,1,250,120,"Vertrieb_3","Köln",11,"2021-11-09"]
[312,1,100,100,"Vertrieb_4","Frankfurt am Main",11,"2021-11-10"]
[313,1,200,110,"Vertrieb_1","Hamburg",11,"2021-11-11"]
[314,1,250,120,"Vertrieb_2","München",11,"2021-11-12"]
[315,1,100,100,"Vertrieb_3","Köln",11,"2021-11-13"]
[316,1,200,110,"Vertrieb_4","Frankfurt am Main",11,"2021-11-14"]
[317,1,250,120,"Vertrieb_1","Hamburg",11,"2021-11-15"]
[318,1,100,100,"Vertrieb_2","München",11,"2021-11-16"]
[319,1,200,110,"Vertrieb_3","Köln",11,"2021-11-17"]
[320,1,250,120,"Vertrieb_4","Frankfurt am Main",11,"2021-11-18"]
[321,1,100,100,"Vertrieb_1","Hamburg",11,"2021-11-19"]
[322,1,200,110,"Vertrieb_2","München",11,"2021-11-20"]
[323,1,250,120,"Vertrieb_3","Köln",11,"2021-11-21"]
[324,1,100,100,"Vertrieb_4","Frankfurt am Main",11,"2021-11-22"]
[325,1,200,110,"Vertrieb_1","Hamburg",11,"2021-11-23"]
[326,1,250,120,"Vertrieb_2","München",11,"2021-11-24"]
[327,1,100,100,"Vertrieb_3","Köln",11,"2021-11-25"]
[328,1,200,110,"Vertrieb_4","Frankfurt am Main",11,"2021-11-26"]
[329,1,250,120,"Vertrieb_1","Hamburg",11,"2021-11-27"]
[330,1,100,100,"Vertrieb_2","München",11,"2021-11-28"]
[331,1,200,110,"Vertrieb_3","Köln",11,"2021-11-29"]
[332,1,100,100,"Vertrieb_4","Frankfurt am Main",11,"2021-11-30"]
[333,1,200,110,"Vertrieb_1","Hamburg",12,"2021-12-01"]
[334,1,250,120,"Vertrieb_2","München",12,"2021-12-02"]
[335,1,100,100,"Vertrieb_3","Köln",12,"2021-12-03"]
[336,1,200,110,"Vertrieb_4","Frankfurt am Main",12,"2021-12-04"]
[337,1,250,120,"Vertrieb_1","Hamburg",12,"2021-12-05"]
[338,1,100,100,"Vertrieb_2","München",12,"2021-12-06"]
[339,1,200,110,"Vertrieb_3","Köln",12,"2021-12-07"]
[340,1,250,120,"Vertrieb_4","Frankfurt am Main",12,"2021-12-08"]
[341,1,100,100,"Vertrieb_1","Hamburg",12,"2021-12-09"]
[342,1,200,110,"Vertrieb_2","München",12,"2021-12-10"]
[343,1,250,120,"Vertrieb_3","Köln",12,"2021-12-11"]
[344,1,100,100,"Vertrieb_4","Frankfurt am Main",12,"2021-12-12"]
[345,1,200,110,"Vertrieb_1","Hamburg",12,"2021-12-13"]
[346,1,250,120,"Vertrieb_2","München",12,"2021-12-14"]
[347,1,100,100,"Vertrieb_3","Köln",12,"2021-12-15"]
[348,1,200,110,"Vertrieb_4","Frankfurt am Main",12,"2021-12-16"]
[349,1,250,120,"Vertrieb_1","Hamburg",12,"2021-12-17"]
[350,1,100,100,"Vertrieb_2","München",12,"2021-12-18"]
[351,1,200,110,"Vertrieb_3","Köln",12,"2021-12-19"]
[352,1,250,120,"Vertrieb_4","Frankfurt am Main",12,"2021-12-20"]
[353,1,100,100,"Vertrieb_1","Hamburg",12,"2021-12-21"]
[354,1,200,110,"Vertrieb_2","München",12,"2021-12-22"]
[355,1,250,120,"Vertrieb_3","Köln",12,"2021-12-23"]
[356,1,100,100,"Vertrieb_4","Frankfurt am Main",12,"2021-12-24"]
[357,1,200,110,"Vertrieb_1","Hamburg",12,"2021-12-25"]
[358,1,250,120,"Vertrieb_2","München",12,"2021-12-26"]
[359,1,100,100,"Vertrieb_3","Köln",12,"2021-12-27"]
[360,1,200,110,"Vertrieb_4","Frankfurt am Main",12,"2021-12-28"]
[361,1,250,120,"Vertrieb_1","Hamburg",12,"2021-12-29"]
[362,1,100,100,"Vertrieb_2","München",12,"2021-12-30"]
[363,1,100,100,"Vertrieb_3","Köln",12,"2021-12-31"]

{"sheet":"Summewenns (Formeln)","index":17,"n_rows":364,"n_cols":14,"rows_kept":364,"cut":false,"hidden":false,"merged":[]}
["lfd. Nr.","Anzahl","Umsatz","Produkt","Vertrieb","Ort","Monat","Datum",null,"Vertrieb",100,110,120,"Summe"]
[1,1,100,100,"Vertrieb_1","Hamburg",1,"2021-01-03",null,"Vertrieb_1",{"$f":"SUMIFS($C:$C,$E:$E,$J2,$D:$D,K$1)","v":2600},{"$f":"SUMIFS($C:$C,$E:$E,$J2,$D:$D,L$1)","v":6200},8500,{"$f":"SUM(K2:M2)","v":17300}]
[2,1,200,110,"Vertrieb_2","München",1,"2021-01-04",null,"Vertrieb_2",{"$f":"SUMIFS($C:$C,$E:$E,$J3,$D:$D,K$1)","v":3400},4800,8250,{"$f":"SUM(K3:M3)","v":16450}]
[3,1,250,120,"Vertrieb_3","Köln",1,"2021-01-05",null,"Vertrieb_3",3500,6200,6250,15950]
[4,1,100,100,"Vertrieb_4","Frankfurt am Main",1,"2021-01-06",null,"Vertrieb_4",2800,6800,7000,16600]
[5,1,200,110,"Vertrieb_1","Hamburg",1,"2021-01-07",null,null,{"$f":"SUM(K2:K5)","v":12300},24000,30000,{"$f":"SUM(N2:N5)","v":66300}]
[6,1,200,110,"Vertrieb_2","München",1,"2021-01-08"]
[7,1,250,120,"Vertrieb_3","Köln",1,"2021-01-09"]
[8,1,100,100,"Vertrieb_4","Frankfurt am Main",1,"2021-01-10",null,"im Vergleich dazu mit Pivot:"]
[9,1,200,110,"Vertrieb_1","Hamburg",1,"2021-01-11",null,"Summe von Umsatz","Spaltenbeschriftungen"]
[10,1,250,120,"Vertrieb_2","München",1,"2021-01-12",null,"Zeilenbeschriftungen",100,110,120,"Gesamtergebnis"]
[11,1,250,120,"Vertrieb_3","Köln",1,"2021-01-13",null,"Vertrieb_1",2600,6200,8500,17300]
[12,1,100,100,"Vertrieb_4","Frankfurt am Main",1,"2021-01-14",null,"Vertrieb_2",3400,4800,8250,16450]
[13,1,200,110,"Vertrieb_1","Hamburg",1,"2021-01-15",null,"Vertrieb_3",3500,6200,6250,15950]
[14,1,250,120,"Vertrieb_2","München",1,"2021-01-16",null,"Vertrieb_4",2800,6800,7000,16600]
[15,1,100,100,"Vertrieb_3","Köln",1,"2021-01-17",null,"Gesamtergebnis",12300,24000,30000,66300]
[16,1,200,110,"Vertrieb_4","Frankfurt am Main",1,"2021-01-18"]
[17,1,250,120,"Vertrieb_1","Hamburg",1,"2021-01-19"]
[18,1,100,100,"Vertrieb_2","München",1,"2021-01-20"]
[19,1,200,110,"Vertrieb_3","Köln",1,"2021-01-21"]
[20,1,250,120,"Vertrieb_4","Frankfurt am Main",1,"2021-01-22"]
[21,1,100,100,"Vertrieb_1","Hamburg",1,"2021-01-23"]
[22,1,250,120,"Vertrieb_2","München",1,"2021-01-24"]
[23,1,100,100,"Vertrieb_3","Köln",1,"2021-01-25"]
[24,1,200,110,"Vertrieb_4","Frankfurt am Main",1,"2021-01-26"]
[25,1,250,120,"Vertrieb_1","Hamburg",1,"2021-01-27"]
[26,1,100,100,"Vertrieb_2","München",1,"2021-01-28"]
[27,1,200,110,"Vertrieb_3","Köln",1,"2021-01-29"]
[28,1,250,120,"Vertrieb_4","Frankfurt am Main",1,"2021-01-30"]
[29,1,100,100,"Vertrieb_1","Hamburg",1,"2021-01-31"]
[30,1,200,110,"Vertrieb_2","München",2,"2021-02-01"]
[31,1,250,120,"Vertrieb_3","Köln",2,"2021-02-02"]
[32,1,100,100,"Vertrieb_4","Frankfurt am Main",2,"2021-02-03"]
[33,1,200,110,"Vertrieb_1","Hamburg",2,"2021-02-04"]
[34,1,250,120,"Vertrieb_2","München",2,"2021-02-05"]
[35,1,100,100,"Vertrieb_3","Köln",2,"2021-02-06"]
[36,1,200,110,"Vertrieb_4","Frankfurt am Main",2,"2021-02-07"]
[37,1,250,120,"Vertrieb_1","Hamburg",2,"2021-02-08"]
[38,1,100,100,"Vertrieb_2","München",2,"2021-02-09"]
[39,1,200,110,"Vertrieb_3","Köln",2,"2021-02-10"]
[40,1,250,120,"Vertrieb_4","Frankfurt am Main",2,"2021-02-11"]
[41,1,100,100,"Vertrieb_1","Hamburg",2,"2021-02-12"]
[42,1,200,110,"Vertrieb_2","München",2,"2021-02-13"]
[43,1,250,120,"Vertrieb_3","Köln",2,"2021-02-14"]
[44,1,100,100,"Vertrieb_4","Frankfurt am Main",2,"2021-02-15"]
[45,1,200,110,"Vertrieb_1","Hamburg",2,"2021-02-16"]
[46,1,250,120,"Vertrieb_2","München",2,"2021-02-17"]
[47,1,100,100,"Vertrieb_3","Köln",2,"2021-02-18"]
[48,1,200,110,"Vertrieb_4","Frankfurt am Main",2,"2021-02-19"]
[49,1,250,120,"Vertrieb_1","Hamburg",2,"2021-02-20"]
[50,1,100,100,"Vertrieb_2","München",2,"2021-02-21"]
[51,1,200,110,"Vertrieb_3","Köln",2,"2021-02-22"]
[52,1,250,120,"Vertrieb_4","Frankfurt am Main",2,"2021-02-23"]
[53,1,200,110,"Vertrieb_1","Hamburg",2,"2021-02-24"]
[54,1,250,120,"Vertrieb_2","München",2,"2021-02-25"]
[55,1,100,100,"Vertrieb_3","Köln",2,"2021-02-26"]
[56,1,200,110,"Vertrieb_4","Frankfurt am Main",2,"2021-02-27"]
[57,1,250,120,"Vertrieb_1","Hamburg",2,"2021-02-28"]
[58,1,100,100,"Vertrieb_2","München",3,"2021-03-01"]
[59,1,200,110,"Vertrieb_3","Köln",3,"2021-03-02"]
[60,1,250,120,"Vertrieb_4","Frankfurt am Main",3,"2021-03-03"]
[61,1,100,100,"Vertrieb_1","Hamburg",3,"2021-03-04"]
[62,1,200,110,"Vertrieb_2","München",3,"2021-03-05"]
[63,1,250,120,"Vertrieb_3","Köln",3,"2021-03-06"]
[64,1,100,100,"Vertrieb_4","Frankfurt am Main",3,"2021-03-07"]
[65,1,200,110,"Vertrieb_1","Hamburg",3,"2021-03-08"]
[66,1,250,120,"Vertrieb_2","München",3,"2021-03-09"]
[67,1,100,100,"Vertrieb_3","Köln",3,"2021-03-10"]
[68,1,200,110,"Vertrieb_4","Frankfurt am Main",3,"2021-03-11"]
[69,1,250,120,"Vertrieb_1","Hamburg",3,"2021-03-12"]
[70,1,100,100,"Vertrieb_2","München",3,"2021-03-13"]
[71,1,200,110,"Vertrieb_3","Köln",3,"2021-03-14"]
[72,1,250,120,"Vertrieb_4","Frankfurt am Main",3,"2021-03-15"]
[73,1,100,100,"Vertrieb_1","Hamburg",3,"2021-03-16"]
[74,1,200,110,"Vertrieb_2","München",3,"2021-03-17"]
[75,1,250,120,"Vertrieb_3","Köln",3,"2021-03-18"]
[76,1,100,100,"Vertrieb_4","Frankfurt am Main",3,"2021-03-19"]
[77,1,200,110,"Vertrieb_1","Hamburg",3,"2021-03-20"]
[78,1,250,120,"Vertrieb_2","München",3,"2021-03-21"]
[79,1,100,100,"Vertrieb_3","Köln",3,"2021-03-22"]
[80,1,200,110,"Vertrieb_4","Frankfurt am Main",3,"2021-03-23"]
[81,1,250,120,"Vertrieb_1","Hamburg",3,"2021-03-24"]
[82,1,100,100,"Vertrieb_2","München",3,"2021-03-25"]
[83,1,200,110,"Vertrieb_3","Köln",3,"2021-03-26"]
[84,1,100,100,"Vertrieb_4","Frankfurt am Main",3,"2021-03-27"]
[85,1,200,110,"Vertrieb_1","Hamburg",3,"2021-03-28"]
[86,1,250,120,"Vertrieb_2","München",3,"2021-03-29"]
[87,1,100,100,"Vertrieb_3","Köln",3,"2021-03-30"]
[88,1,200,110,"Vertrieb_4","Frankfurt am Main",3,"2021-03-31"]
[89,1,250,120,"Vertrieb_1","Hamburg",4,"2021-04-01"]
[90,1,100,100,"Vertrieb_2","München",4,"2021-04-02"]
[91,1,200,110,"Vertrieb_3","Köln",4,"2021-04-03"]
[92,1,250,120,"Vertrieb_4","Frankfurt am Main",4,"2021-04-04"]
[93,1,100,100,"Vertrieb_1","Hamburg",4,"2021-04-05"]
[94,1,200,110,"Vertrieb_2","München",4,"2021-04-06"]
[95,1,250,120,"Vertrieb_3","Köln",4,"2021-04-07"]
[96,1,100,100,"Vertrieb_4","Frankfurt am Main",4,"2021-04-08"]
[97,1,200,110,"Vertrieb_1","Hamburg",4,"2021-04-09"]
[98,1,250,120,"Vertrieb_2","München",4,"2021-04-10"]
[99,1,100,100,"Vertrieb_3","Köln",4,"2021-04-11"]
[100,1,200,110,"Vertrieb_4","Frankfurt am Main",4,"2021-04-12"]
[101,1,250,120,"Vertrieb_1","Hamburg",4,"2021-04-13"]
[102,1,100,100,"Vertrieb_2","München",4,"2021-04-14"]
[103,1,200,110,"Vertrieb_3","Köln",4,"2021-04-15"]
[104,1,250,120,"Vertrieb_4","Frankfurt am Main",4,"2021-04-16"]
[105,1,100,100,"Vertrieb_1","Hamburg",4,"2021-04-17"]
[106,1,200,110,"Vertrieb_2","München",4,"2021-04-18"]
[107,1,250,120,"Vertrieb_3","Köln",4,"2021-04-19"]
[108,1,100,100,"Vertrieb_4","Frankfurt am Main",4,"2021-04-20"]
[109,1,200,110,"Vertrieb_1","Hamburg",4,"2021-04-21"]
[110,1,250,120,"Vertrieb_2","München",4,"2021-04-22"]
[111,1,100,100,"Vertrieb_3","Köln",4,"2021-04-23"]
[112,1,200,110,"Vertrieb_4","Frankfurt am Main",4,"2021-04-24"]
[113,1,250,120,"Vertrieb_1","Hamburg",4,"2021-04-25"]
[114,1,100,100,"Vertrieb_2","München",4,"2021-04-26"]
[115,1,100,100,"Vertrieb_3","Köln",4,"2021-04-27"]
[116,1,200,110,"Vertrieb_4","Frankfurt am Main",4,"2021-04-28"]
[117,1,250,120,"Vertrieb_1","Hamburg",4,"2021-04-29"]
[118,1,100,100,"Vertrieb_2","München",4,"2021-04-30"]
[119,1,200,110,"Vertrieb_3","Köln",5,"2021-05-01"]
[120,1,250,120,"Vertrieb_4","Frankfurt am Main",5,"2021-05-02"]
[121,1,100,100,"Vertrieb_1","Hamburg",5,"2021-05-03"]
[122,1,200,110,"Vertrieb_2","München",5,"2021-05-04"]
[123,1,250,120,"Vertrieb_3","Köln",5,"2021-05-05"]
[124,1,100,100,"Vertrieb_4","Frankfurt am Main",5,"2021-05-06"]
[125,1,200,110,"Vertrieb_1","Hamburg",5,"2021-05-07"]
[126,1,250,120,"Vertrieb_2","München",5,"2021-05-08"]
[127,1,100,100,"Vertrieb_3","Köln",5,"2021-05-09"]
[128,1,200,110,"Vertrieb_4","Frankfurt am Main",5,"2021-05-10"]
[129,1,250,120,"Vertrieb_1","Hamburg",5,"2021-05-11"]
[130,1,100,100,"Vertrieb_2","München",5,"2021-05-12"]
[131,1,200,110,"Vertrieb_3","Köln",5,"2021-05-13"]
[132,1,250,120,"Vertrieb_4","Frankfurt am Main",5,"2021-05-14"]
[133,1,100,100,"Vertrieb_1","Hamburg",5,"2021-05-15"]
[134,1,200,110,"Vertrieb_2","München",5,"2021-05-16"]
[135,1,250,120,"Vertrieb_3","Köln",5,"2021-05-17"]
[136,1,100,100,"Vertrieb_4","Frankfurt am Main",5,"2021-05-18"]
[137,1,200,110,"Vertrieb_1","Hamburg",5,"2021-05-19"]
[138,1,250,120,"Vertrieb_2","München",5,"2021-05-20"]
[139,1,100,100,"Vertrieb_3","Köln",5,"2021-05-21"]
[140,1,200,110,"Vertrieb_4","Frankfurt am Main",5,"2021-05-22"]
[141,1,250,120,"Vertrieb_1","Hamburg",5,"2021-05-23"]
[142,1,100,100,"Vertrieb_2","München",5,"2021-05-24"]
[143,1,200,110,"Vertrieb_3","Köln",5,"2021-05-25"]
[144,1,250,120,"Vertrieb_4","Frankfurt am Main",5,"2021-05-26"]
[145,1,100,100,"Vertrieb_1","Hamburg",5,"2021-05-27"]
[146,1,250,120,"Vertrieb_2","München",5,"2021-05-28"]
[147,1,100,100,"Vertrieb_3","Köln",5,"2021-05-29"]
[148,1,200,110,"Vertrieb_4","Frankfurt am Main",5,"2021-05-30"]
[149,1,250,120,"Vertrieb_1","Hamburg",5,"2021-05-31"]
[150,1,100,100,"Vertrieb_2","München",6,"2021-06-01"]
[151,1,200,110,"Vertrieb_3","Köln",6,"2021-06-02"]
[152,1,250,120,"Vertrieb_4","Frankfurt am Main",6,"2021-06-03"]
[153,1,100,100,"Vertrieb_1","Hamburg",6,"2021-06-04"]
[154,1,200,110,"Vertrieb_2","München",6,"2021-06-05"]
[155,1,250,120,"Vertrieb_3","Köln",6,"2021-06-06"]
[156,1,100,100,"Vertrieb_4","Frankfurt am Main",6,"2021-06-07"]
[157,1,200,110,"Vertrieb_1","Hamburg",6,"2021-06-08"]
[158,1,250,120,"Vertrieb_2","München",6,"2021-06-09"]
[159,1,100,100,"Vertrieb_3","Köln",6,"2021-06-10"]
[160,1,200,110,"Vertrieb_4","Frankfurt am Main",6,"2021-06-11"]
[161,1,250,120,"Vertrieb_1","Hamburg",6,"2021-06-12"]
[162,1,100,100,"Vertrieb_2","München",6,"2021-06-13"]
[163,1,200,110,"Vertrieb_3","Köln",6,"2021-06-14"]
[164,1,250,120,"Vertrieb_4","Frankfurt am Main",6,"2021-06-15"]
[165,1,100,100,"Vertrieb_1","Hamburg",6,"2021-06-16"]
[166,1,200,110,"Vertrieb_2","München",6,"2021-06-17"]
[167,1,250,120,"Vertrieb_3","Köln",6,"2021-06-18"]
[168,1,100,100,"Vertrieb_4","Frankfurt am Main",6,"2021-06-19"]
[169,1,200,110,"Vertrieb_1","Hamburg",6,"2021-06-20"]
[170,1,250,120,"Vertrieb_2","München",6,"2021-06-21"]
[171,1,100,100,"Vertrieb_3","Köln",6,"2021-06-22"]
[172,1,200,110,"Vertrieb_4","Frankfurt am Main",6,"2021-06-23"]
[173,1,250,120,"Vertrieb_1","Hamburg",6,"2021-06-24"]
[174,1,100,100,"Vertrieb_2","München",6,"2021-06-25"]
[175,1,200,110,"Vertrieb_3","Köln",6,"2021-06-26"]
[176,1,250,120,"Vertrieb_4","Frankfurt am Main",6,"2021-06-27"]
[177,1,200,110,"Vertrieb_1","Hamburg",6,"2021-06-28"]
[178,1,250,120,"Vertrieb_2","München",6,"2021-06-29"]
[179,1,100,100,"Vertrieb_3","Köln",6,"2021-06-30"]
[180,1,200,110,"Vertrieb_4","Frankfurt am Main",7,"2021-07-01"]
[181,1,250,120,"Vertrieb_1","Hamburg",7,"2021-07-02"]
[182,1,100,100,"Vertrieb_2","München",7,"2021-07-03"]
[183,1,200,110,"Vertrieb_3","Köln",7,"2021-07-04"]
[184,1,250,120,"Vertrieb_4","Frankfurt am Main",7,"2021-07-05"]
[185,1,100,100,"Vertrieb_1","Hamburg",7,"2021-07-06"]
[186,1,200,110,"Vertrieb_2","München",7,"2021-07-07"]
[187,1,250,120,"Vertrieb_3","Köln",7,"2021-07-08"]
[188,1,100,100,"Vertrieb_4","Frankfurt am Main",7,"2021-07-09"]
[189,1,200,110,"Vertrieb_1","Hamburg",7,"2021-07-10"]
[190,1,250,120,"Vertrieb_2","München",7,"2021-07-11"]
[191,1,100,100,"Vertrieb_3","Köln",7,"2021-07-12"]
[192,1,200,110,"Vertrieb_4","Frankfurt am Main",7,"2021-07-13"]
[193,1,250,120,"Vertrieb_1","Hamburg",7,"2021-07-14"]
[194,1,100,100,"Vertrieb_2","München",7,"2021-07-15"]
[195,1,200,110,"Vertrieb_3","Köln",7,"2021-07-16"]
[196,1,250,120,"Vertrieb_4","Frankfurt am Main",7,"2021-07-17"]
[197,1,100,100,"Vertrieb_1","Hamburg",7,"2021-07-18"]
[198,1,200,110,"Vertrieb_2","München",7,"2021-07-19"]
[199,1,250,120,"Vertrieb_3","Köln",7,"2021-07-20"]
[200,1,100,100,"Vertrieb_4","Frankfurt am Main",7,"2021-07-21"]
[201,1,200,110,"Vertrieb_1","Hamburg",7,"2021-07-22"]
[202,1,250,120,"Vertrieb_2","München",7,"2021-07-23"]
[203,1,100,100,"Vertrieb_3","Köln",7,"2021-07-24"]
[204,1,200,110,"Vertrieb_4","Frankfurt am Main",7,"2021-07-25"]
[205,1,250,120,"Vertrieb_1","Hamburg",7,"2021-07-26"]
[206,1,100,100,"Vertrieb_2","München",7,"2021-07-27"]
[207,1,200,110,"Vertrieb_3","Köln",7,"2021-07-28"]
[208,1,100,100,"Vertrieb_4","Frankfurt am Main",7,"2021-07-29"]
[209,1,200,110,"Vertrieb_1","Hamburg",7,"2021-07-30"]
[210,1,250,120,"Vertrieb_2","München",7,"2021-07-31"]
[211,1,100,100,"Vertrieb_3","Köln",8,"2021-08-01"]
[212,1,200,110,"Vertrieb_4","Frankfurt am Main",8,"2021-08-02"]
[213,1,250,120,"Vertrieb_1","Hamburg",8,"2021-08-03"]
[214,1,100,100,"Vertrieb_2","München",8,"2021-08-04"]
[215,1,200,110,"Vertrieb_3","Köln",8,"2021-08-05"]
[216,1,250,120,"Vertrieb_4","Frankfurt am Main",8,"2021-08-06"]
[217,1,100,100,"Vertrieb_1","Hamburg",8,"2021-08-07"]
[218,1,200,110,"Vertrieb_2","München",8,"2021-08-08"]
[219,1,250,120,"Vertrieb_3","Köln",8,"2021-08-09"]
[220,1,100,100,"Vertrieb_4","Frankfurt am Main",8,"2021-08-10"]
[221,1,200,110,"Vertrieb_1","Hamburg",8,"2021-08-11"]
[222,1,250,120,"Vertrieb_2","München",8,"2021-08-12"]
[223,1,100,100,"Vertrieb_3","Köln",8,"2021-08-13"]
[224,1,200,110,"Vertrieb_4","Frankfurt am Main",8,"2021-08-14"]
[225,1,250,120,"Vertrieb_1","Hamburg",8,"2021-08-15"]
[226,1,100,100,"Vertrieb_2","München",8,"2021-08-16"]
[227,1,200,110,"Vertrieb_3","Köln",8,"2021-08-17"]
[228,1,250,120,"Vertrieb_4","Frankfurt am Main",8,"2021-08-18"]
[229,1,100,100,"Vertrieb_1","Hamburg",8,"2021-08-19"]
[230,1,200,110,"Vertrieb_2","München",8,"2021-08-20"]
[231,1,250,120,"Vertrieb_3","Köln",8,"2021-08-21"]
[232,1,100,100,"Vertrieb_4","Frankfurt am Main",8,"2021-08-22"]
[233,1,200,110,"Vertrieb_1","Hamburg",8,"2021-08-23"]
[234,1,250,120,"Vertrieb_2","München",8,"2021-08-24"]
[235,1,100,100,"Vertrieb_3","Köln",8,"2021-08-25"]
[236,1,200,110,"Vertrieb_4","Frankfurt am Main",8,"2021-08-26"]
[237,1,250,120,"Vertrieb_1","Hamburg",8,"2021-08-27"]
[238,1,100,100,"Vertrieb_2","München",8,"2021-08-28"]
[239,1,100,100,"Vertrieb_3","Köln",8,"2021-08-29"]
[240,1,200,110,"Vertrieb_4","Frankfurt am Main",8,"2021-08-30"]
[241,1,250,120,"Vertrieb_1","Hamburg",8,"2021-08-31"]
[242,1,100,100,"Vertrieb_2","München",9,"2021-09-01"]
[243,1,200,110,"Vertrieb_3","Köln",9,"2021-09-02"]
[244,1,250,120,"Vertrieb_4","Frankfurt am Main",9,"2021-09-03"]
[245,1,100,100,"Vertrieb_1","Hamburg",9,"2021-09-04"]
[246,1,200,110,"Vertrieb_2","München",9,"2021-09-05"]
[247,1,250,120,"Vertrieb_3","Köln",9,"2021-09-06"]
[248,1,100,100,"Vertrieb_4","Frankfurt am Main",9,"2021-09-07"]
[249,1,200,110,"Vertrieb_1","Hamburg",9,"2021-09-08"]
[250,1,250,120,"Vertrieb_2","München",9,"2021-09-09"]
[251,1,100,100,"Vertrieb_3","Köln",9,"2021-09-10"]
[252,1,200,110,"Vertrieb_4","Frankfurt am Main",9,"2021-09-11"]
[253,1,250,120,"Vertrieb_1","Hamburg",9,"2021-09-12"]
[254,1,100,100,"Vertrieb_2","München",9,"2021-09-13"]
[255,1,200,110,"Vertrieb_3","Köln",9,"2021-09-14"]
[256,1,250,120,"Vertrieb_4","Frankfurt am Main",9,"2021-09-15"]
[257,1,100,100,"Vertrieb_1","Hamburg",9,"2021-09-16"]
[258,1,200,110,"Vertrieb_2","München",9,"2021-09-17"]
[259,1,250,120,"Vertrieb_3","Köln",9,"2021-09-18"]
[260,1,100,100,"Vertrieb_4","Frankfurt am Main",9,"2021-09-19"]
[261,1,200,110,"Vertrieb_1","Hamburg",9,"2021-09-20"]
[262,1,250,120,"Vertrieb_2","München",9,"2021-09-21"]
[263,1,100,100,"Vertrieb_3","Köln",9,"2021-09-22"]
[264,1,200,110,"Vertrieb_4","Frankfurt am Main",9,"2021-09-23"]
[265,1,250,120,"Vertrieb_1","Hamburg",9,"2021-09-24"]
[266,1,100,100,"Vertrieb_2","München",9,"2021-09-25"]
[267,1,200,110,"Vertrieb_3","Köln",9,"2021-09-26"]
[268,1,250,120,"Vertrieb_4","Frankfurt am Main",9,"2021-09-27"]
[269,1,100,100,"Vertrieb_1","Hamburg",9,"2021-09-28"]
[270,1,250,120,"Vertrieb_2","München",9,"2021-09-29"]
[271,1,100,100,"Vertrieb_3","Köln",9,"2021-09-30"]
[272,1,200,110,"Vertrieb_4","Frankfurt am Main",10,"2021-10-01"]
[273,1,250,120,"Vertrieb_1","Hamburg",10,"2021-10-02"]
[274,1,100,100,"Vertrieb_2","München",10,"2021-10-03"]
[275,1,200,110,"Vertrieb_3","Köln",10,"2021-10-04"]
[276,1,250,120,"Vertrieb_4","Frankfurt am Main",10,"2021-10-05"]
[277,1,100,100,"Vertrieb_1","Hamburg",10,"2021-10-06"]
[278,1,200,110,"Vertrieb_2","München",10,"2021-10-07"]
[279,1,250,120,"Vertrieb_3","Köln",10,"2021-10-08"]
[280,1,100,100,"Vertrieb_4","Frankfurt am Main",10,"2021-10-09"]
[281,1,200,110,"Vertrieb_1","Hamburg",10,"2021-10-10"]
[282,1,250,120,"Vertrieb_2","München",10,"2021-10-11"]
[283,1,100,100,"Vertrieb_3","Köln",10,"2021-10-12"]
[284,1,200,110,"Vertrieb_4","Frankfurt am Main",10,"2021-10-13"]
[285,1,250,120,"Vertrieb_1","Hamburg",10,"2021-10-14"]
[286,1,100,100,"Vertrieb_2","München",10,"2021-10-15"]
[287,1,200,110,"Vertrieb_3","Köln",10,"2021-10-16"]
[288,1,250,120,"Vertrieb_4","Frankfurt am Main",10,"2021-10-17"]
[289,1,100,100,"Vertrieb_1","Hamburg",10,"2021-10-18"]
[290,1,200,110,"Vertrieb_2","München",10,"2021-10-19"]
[291,1,250,120,"Vertrieb_3","Köln",10,"2021-10-20"]
[292,1,100,100,"Vertrieb_4","Frankfurt am Main",10,"2021-10-21"]
[293,1,200,110,"Vertrieb_1","Hamburg",10,"2021-10-22"]
[294,1,250,120,"Vertrieb_2","München",10,"2021-10-23"]
[295,1,100,100,"Vertrieb_3","Köln",10,"2021-10-24"]
[296,1,200,110,"Vertrieb_4","Frankfurt am Main",10,"2021-10-25"]
[297,1,250,120,"Vertrieb_1","Hamburg",10,"2021-10-26"]
[298,1,100,100,"Vertrieb_2","München",10,"2021-10-27"]
[299,1,200,110,"Vertrieb_3","Köln",10,"2021-10-28"]
[300,1,250,120,"Vertrieb_4","Frankfurt am Main",10,"2021-10-29"]
[301,1,200,110,"Vertrieb_1","Hamburg",10,"2021-10-30"]
[302,1,250,120,"Vertrieb_2","München",10,"2021-10-31"]
[303,1,100,100,"Vertrieb_3","Köln",11,"2021-11-01"]
[304,1,200,110,"Vertrieb_4","Frankfurt am Main",11,"2021-11-02"]
[305,1,250,120,"Vertrieb_1","Hamburg",11,"2021-11-03"]
[306,1,100,100,"Vertrieb_2","München",11,"2021-11-04"]
[307,1,200,110,"Vertrieb_3","Köln",11,"2021-11-05"]
[308,1,250,120,"Vertrieb_4","Frankfurt am Main",11,"2021-11-06"]
[309,1,100,100,"Vertrieb_1","Hamburg",11,"2021-11-07"]
[310,1,200,110,"Vertrieb_2","München",11,"2021-11-08"]
[311,1,250,120,"Vertrieb_3","Köln",11,"2021-11-09"]
[312,1,100,100,"Vertrieb_4","Frankfurt am Main",11,"2021-11-10"]
[313,1,200,110,"Vertrieb_1","Hamburg",11,"2021-11-11"]
[314,1,250,120,"Vertrieb_2","München",11,"2021-11-12"]
[315,1,100,100,"Vertrieb_3","Köln",11,"2021-11-13"]
[316,1,200,110,"Vertrieb_4","Frankfurt am Main",11,"2021-11-14"]
[317,1,250,120,"Vertrieb_1","Hamburg",11,"2021-11-15"]
[318,1,100,100,"Vertrieb_2","München",11,"2021-11-16"]
[319,1,200,110,"Vertrieb_3","Köln",11,"2021-11-17"]
[320,1,250,120,"Vertrieb_4","Frankfurt am Main",11,"2021-11-18"]
[321,1,100,100,"Vertrieb_1","Hamburg",11,"2021-11-19"]
[322,1,200,110,"Vertrieb_2","München",11,"2021-11-20"]
[323,1,250,120,"Vertrieb_3","Köln",11,"2021-11-21"]
[324,1,100,100,"Vertrieb_4","Frankfurt am Main",11,"2021-11-22"]
[325,1,200,110,"Vertrieb_1","Hamburg",11,"2021-11-23"]
[326,1,250,120,"Vertrieb_2","München",11,"2021-11-24"]
[327,1,100,100,"Vertrieb_3","Köln",11,"2021-11-25"]
[328,1,200,110,"Vertrieb_4","Frankfurt am Main",11,"2021-11-26"]
[329,1,250,120,"Vertrieb_1","Hamburg",11,"2021-11-27"]
[330,1,100,100,"Vertrieb_2","München",11,"2021-11-28"]
[331,1,200,110,"Vertrieb_3","Köln",11,"2021-11-29"]
[332,1,100,100,"Vertrieb_4","Frankfurt am Main",11,"2021-11-30"]
[333,1,200,110,"Vertrieb_1","Hamburg",12,"2021-12-01"]
[334,1,250,120,"Vertrieb_2","München",12,"2021-12-02"]
[335,1,100,100,"Vertrieb_3","Köln",12,"2021-12-03"]
[336,1,200,110,"Vertrieb_4","Frankfurt am Main",12,"2021-12-04"]
[337,1,250,120,"Vertrieb_1","Hamburg",12,"2021-12-05"]
[338,1,100,100,"Vertrieb_2","München",12,"2021-12-06"]
[339,1,200,110,"Vertrieb_3","Köln",12,"2021-12-07"]
[340,1,250,120,"Vertrieb_4","Frankfurt am Main",12,"2021-12-08"]
[341,1,100,100,"Vertrieb_1","Hamburg",12,"2021-12-09"]
[342,1,200,110,"Vertrieb_2","München",12,"2021-12-10"]
[343,1,250,120,"Vertrieb_3","Köln",12,"2021-12-11"]
[344,1,100,100,"Vertrieb_4","Frankfurt am Main",12,"2021-12-12"]
[345,1,200,110,"Vertrieb_1","Hamburg",12,"2021-12-13"]
[346,1,250,120,"Vertrieb_2","München",12,"2021-12-14"]
[347,1,100,100,"Vertrieb_3","Köln",12,"2021-12-15"]
[348,1,200,110,"Vertrieb_4","Frankfurt am Main",12,"2021-12-16"]
[349,1,250,120,"Vertrieb_1","Hamburg",12,"2021-12-17"]
[350,1,100,100,"Vertrieb_2","München",12,"2021-12-18"]
[351,1,200,110,"Vertrieb_3","Köln",12,"2021-12-19"]
[352,1,250,120,"Vertrieb_4","Frankfurt am Main",12,"2021-12-20"]
[353,1,100,100,"Vertrieb_1","Hamburg",12,"2021-12-21"]
[354,1,200,110,"Vertrieb_2","München",12,"2021-12-22"]
[355,1,250,120,"Vertrieb_3","Köln",12,"2021-12-23"]
[356,1,100,100,"Vertrieb_4","Frankfurt am Main",12,"2021-12-24"]
[357,1,200,110,"Vertrieb_1","Hamburg",12,"2021-12-25"]
[358,1,250,120,"Vertrieb_2","München",12,"2021-12-26"]
[359,1,100,100,"Vertrieb_3","Köln",12,"2021-12-27"]
[360,1,200,110,"Vertrieb_4","Frankfurt am Main",12,"2021-12-28"]
[361,1,250,120,"Vertrieb_1","Hamburg",12,"2021-12-29"]
[362,1,100,100,"Vertrieb_2","München",12,"2021-12-30"]
[363,1,100,100,"Vertrieb_3","Köln",12,"2021-12-31"]

{"sheet":"SortierteListe Grund-Parameter","index":18,"n_rows":11,"n_cols":2,"rows_kept":11,"cut":false,"hidden":true,"merged":[]}
[]
[]
["Kopfzeile",1]
["Sortierzeile",2]
["Mit Nummernspalte",true]
["Mit Gliederung",true]
["Alle Formeln durch Werte ersetzen",false]
["Zwischensummen als Formeln",true]
["Sortierart Buchhaltung",false]
["Datev Übergabe",false]
["Datev Datei"]

{"sheet":"SortierteListe Parameter","index":19,"n_rows":48,"n_cols":8,"rows_kept":48,"cut":false,"hidden":true,"merged":[]}
[]
[]
["Sortierspalte 1","C"]
["Sortierspalte 2"]
["Sortierspalte 3"]
["Seitenwechsel 1",false]
["Seitenwechsel 2",false]
["Seitenwechsel 3",false]
["Zwischensumme 1",true]
["Zwischensumme 2",false]
["Zwischensumme 3",false]
["Kopfzeile 1",false]
["Kopfzeile 2",false]
["Kopfzeile 3",false]
["Zeilenhöhe 1",17]
["Zeilenhöhe 2",17]
["Zeilenhöhe 3",17]
[null,"Name","Fett","Kursiv","Größe","Durchgestrichen","Underline","Colorindex"]
["Font 1","Calibri",true,false,14,false,-4119,23]
["Font 2","Calibri",true,false,14,false,-4119,14]
["Font 3","Calibri",true,false,14,false,-4119,3]
[]
[]
[]
[]
[]
[]
[]
[]
[]
[]
[]
[]
[]
["Anzahl Zwischensummenspalten",2]
["Zwischensummenspalten",1,7]
["Filterspalte 1","A"]
["Filterspalte 2"]
["Filterspalte 3"]
["Filter Von 1"]
["Filter Von 2"]
["Filter Von 3"]
["Filter Bis 1"]
["Filter Bis 2"]
["Filter Bis 3"]
[]
["Anzahl ausgeblendete Spalten",0]
["Ausgeblendete Spalten"]